{"text_format":"1","workbook":"xlsx","n_sheets":22,"sheets":["Instructions","Printable Meter Application","Interactive Form","EX100-200","Config Pick Data","EX800","EX90","iMAG4700","WMP","PE202","FT 400 Series","IP100-200","IP800","S-Series","WT Series","AG3000","AG90","Meter Pick Data","Cost Data","Quote Template","Version History","Sheet10"],"not_rendered":{"charts":0,"images":24,"macros":1,"external_links":0,"defined_names":120,"comments":0,"pivot_tables":0},"unopened":[],"bounds":{"document_bytes":16777216,"sheet_cells":100000,"rows_first":2000,"rows_last":500,"rows_between":2000,"halvings":0,"cell_chars":16384,"cell_head_chars":4096},"cells_cut":0,"cells_raw":0,"read":"whole","date_system":"1900"}

{"sheet":"Instructions","index":0,"n_rows":38,"n_cols":11,"rows_kept":38,"cut":false,"hidden":false,"merged":[[31,0,31,10],[22,1,22,10],[23,0,23,10],[24,2,24,10],[25,0,25,10],[26,0,26,10],[27,0,27,10],[0,0,0,10],[3,0,3,10],[6,2,6,10],[8,0,8,10],[9,1,9,10],[33,0,33,10],[2,0,2,10],[1,0,1,10],[35,0,35,10],[21,0,21,10],[11,1,11,10],[12,1,12,10],[13,0,13,10],[15,0,15,10],[19,0,19,10],[20,0,20,10],[10,1,10,10],[14,0,14,10],[28,0,28,10],[29,0,29,10],[30,0,30,10]]}
["Instructions"]
["For best results from the Applicator and Pricing Tool, please enable macro's. I promised we did not attach any viruses to this tool."]
[]
["There are multiple tabs to this spreadsheet. There is a printable meter application tab that has a printable version of the interactive sheet. In addition to this instruction tab, there is an interactive sheet that allows you to use drop down lists and data entry to develop the proper meter selection for your project. Fee free to utilize the upper portions to record customer and project contact information before utilizing the drop down menus and data points to interview the end user concerning the application parameters"]
["The",null,"cells are interactive and once completely filled out, will guide you to the correct product for your project."]
[]
["The ",null,"cell near the bottom in rows 31 and 32 will show all applicable meter selections based on the input criteria"]
[]
["1. Fill in the top line data in the Interactive Form. Get as much data as possible relevant to the project including:"]
[null,"Company Name"]
[null,"Customer Name and Contact information"]
[null,"Project Name"]
[null,"Project Location"]
["2. Query the customer about the process conditions and use the drop down menus to complete the form"]
["3. Use the \"Click to Start/Reset\" button to clear all values from the drop down menus. Select the following information from left to right, top to bottom "]
["A. Fluid Type:"]
[null,"Oil","Clean","Fresh"]
[null,"Water","Dirty","Salt"]
[null,null,null,"DI"]
["B.  Temperature - enter a temperature value between 32-200F"]
["C. Pressure - enter a max pressure value between 150 - 500psi "]
["D. Enter a line size between 0.375\" - 48\""]
[null,"Determine the pipe material and thickness"]
["E. Enter the straight run pipe diameters upstream and downstream of the meter"]
["Each",null,"cells are dependent upon each other so please ensure you fill each of them out every time."]
["The remaining data points are necessary information for you to quote and sell exactly what your customer needs."]
["Please ensure you mention each of the points listed on this form to avoid misapplication of the meter and to "]
["ensure your customer gets what they need."]
["Once you have completed the form and collected all of the data you should be left with a couple of choices for meters."]
["There are usually more than one option for every project and it is our job as sales people to guide our customers to the right option."]
[]
["If after collecting all of the data, you are still unsure what would work best for your customer, please contact your regional manager for assistance."]
[]
["Use the remaining tabs to configure the appropriate flow meter for the project. These tabs will help to develop the model code and determine the list price for each meter configuration. There are additional accessories listed below the configuration tools on each tab. Again, when in doubt reach out to your Seametrics Regional Manager for assistance."]
[]
["Feel free to rename and save a copy of this file for each project you are working on. If you are concerned about drive space, perhaps you could print a copy of the interactive form and the configured product tab to a pdf and save those to your project file."]
[]
["We would love your feedback, Feel free to send us an email with suggestions for improvement to ",null,null,null,null,null,null,null,null,null,"staliaferro@seametrics.com"]

{"sheet":"Printable Meter Application","index":1,"n_rows":34,"n_cols":6,"rows_kept":34,"cut":false,"hidden":false,"merged":[[35,0,35,5],[31,1,31,2],[31,3,31,4],[32,1,32,2],[32,3,32,4],[33,0,33,5],[34,0,34,5],[29,0,30,0],[29,1,29,2],[29,3,29,4],[30,3,30,5],[15,1,15,5],[16,0,17,0],[17,4,17,5],[18,0,19,0],[18,1,18,2],[19,1,19,2],[20,3,20,5],[22,0,24,0],[22,4,24,5],[25,1,25,2],[25,3,25,4],[7,0,7,1],[7,2,7,3],[8,0,8,5],[9,0,12,0],[9,1,9,2],[9,3,9,4],[9,5,12,5],[10,3,10,4],[11,3,11,4],[12,3,12,4],[5,0,5,1],[5,2,5,3],[5,4,5,5],[6,0,6,1],[6,2,6,3],[3,0,3,1],[3,2,3,5],[4,0,4,1],[4,2,4,3],[4,4,4,5],[0,0,0,1],[1,0,1,1],[2,0,2,1],[2,2,2,5],[0,2,0,3],[0,4,0,5],[1,2,1,3],[1,4,1,5]]}
[]
["Customer Name",null,"Project Name",null,"Quotation Number"]
[]
["Company",null,"Customer Email"]
[]
["Filled out by:",null,"Date:",null,"Phone"]
[]
["Ship To Number and Street",null,"City",null,"State","Zip"]
[]
["Fluid Type","Water Based",null,"Oil Based"]
[null,"Clean","Fresh","Clean"]
[null,"Dirty","Salt","Dirty"]
[null,null,"DI"]
["Temperature","<130F","<140F","<160F","<200F"]
["Pressure","<150 psi","<175 psi","<200 psi","<400 psi","<500 psi"]
["Line Size \""]
["Pipe Material","PVC","Carbon Steel","Ductile Iron","SS","Other"]
[null,"Sched 40","Sched 80","Sched 100"]
["Straight Run Pipe Diameters","Upstream",null,">10",">5",">2"]
[null,"Downstream",null,">5",">2",">1"]
["Is this a replacement meter?","Yes","No","If so, what type?"]
["Measurement Purpose","Display","Data Log","Control","Billing"]
["Power Available","AC","DC","Solar"]
[null,"120V","12VDC","12VDC"]
[null,"240V","24VDC","24VDC"]
["Telemetry","Yes",null,"No"]
["Outputs","Pulse","Scaled Pulse","4-20mA","4-20mA HART","Modbus"]
["Display?","Local","Remote","Wall","Panel","None"]
["Will meter potentially be flooded?","Yes <10'","No","Maybe","Yes >10'"]
["Can the meter be flanged?","Yes",null,"No"]
[null,"<12\"",">12\""]
["Will customer accept pin in place meter?","Yes",null,"No"]
["Accessible once installed?","Yes",null,"No"]
["Notes:"]

{"sheet":"Interactive Form","index":2,"n_rows":31,"n_cols":6,"rows_kept":31,"cut":false,"hidden":false,"merged":[[34,0,34,5],[35,0,35,5],[28,1,28,2],[28,3,28,5],[29,1,29,2],[29,3,29,5],[30,0,31,5],[32,0,32,5],[26,0,27,0],[26,1,26,2],[26,3,26,5],[27,3,27,5],[33,0,33,5],[7,0,7,1],[7,2,7,3],[6,0,6,1],[22,1,22,2],[22,3,22,4],[19,0,21,0],[19,4,21,5],[8,0,8,5],[9,4,9,5],[10,2,10,5],[11,2,11,5],[12,2,12,5],[13,0,14,0],[14,4,14,5],[15,0,16,0],[17,3,17,5],[6,2,6,3],[1,2,1,3],[0,2,0,3],[0,4,0,5],[1,4,1,5],[5,2,5,3],[5,4,5,5],[4,0,4,1],[5,0,5,1],[4,2,4,3],[4,4,4,5],[0,0,0,1],[1,0,1,1],[2,0,2,1],[2,2,2,5],[3,0,3,1],[3,2,3,5]]}
["Joseph Customer",null,"Magnetic Flow meter",null,"01012021ST-1"]
["Customer Name",null,"Project Name",null,"Quotation Number"]
["Seattle Treatment Plant",null,"place your orders with seametrics.com"]
["Company",null,"Customer Email"]
["Stuart Taliaferro",null,"2021-01-01",null,"757-416-8400"]
["Filled out by:",null,"Date:",null,"Phone"]
["19026 72nd Ave S.",null,"Kent",null,"WA",98032]
["Ship To Number and Street",null,"City",null,"State","Zip"]
[]
["Fluid Type",null,null,null,"<= Select one each from left to right"]
["Temperature (°F)",null,"32 - 200F"]
["Pressure (PSI)",null,"0 - 200psi, 400psi, 500psi"]
["Line Size (Inch)",null,"0.375 - 48\""]
["Pipe Material","Carbon Steel","SS","PVC","Ductile Iron","Other"]
[null,"Sched 40","Sched 80","Sched 100"]
["Straight Run Pipe Diameters",null,"Upstream",">10",">5",">2"]
[null,null,"Downstream",">5",">2",">1"]
["Is this a replacement meter?","Yes","No","If so, what type?"]
["Measurement Purpose","Display","Data Log","Control","Billing"]
["Power Available","AC","DC","Solar","None"]
[null,"120V","12VDC","12VDC"]
[null,"240V","24VDC","24VDC"]
["Telemetry","Yes",null,"No"]
["Outputs","Pulse","Scaled Pulse","4-20mA","4-20mA HART","Modbus"]
["Display?","Local","Remote","Wall","Panel","None"]
["Will meter potentially be flooded?","Yes <10'","No","Maybe","Yes >10'"]
["Can the meter be flanged?","Yes"]
[null,"<12\"",">12\""]
["Will customer accept pin in place meter?","Yes"]
["Accessible once installed?","No"]
[{"$f":"'Config Pick Data'!K51","v":""}]

{"sheet":"EX100-200","index":3,"n_rows":166,"n_cols":8,"rows_kept":166,"cut":false,"hidden":false,"merged":[[164,0,164,1],[164,2,164,5],[165,0,165,1],[165,2,165,5],[159,0,159,1],[159,2,159,5],[160,0,160,1],[160,2,160,5],[161,0,161,1],[161,2,161,5],[162,0,162,1],[162,2,162,5],[163,0,163,1],[163,2,163,5],[154,0,154,1],[154,2,154,5],[155,0,155,1],[155,2,155,5],[156,0,156,1],[156,2,156,5],[157,0,157,1],[157,2,157,5],[158,0,158,1],[158,2,158,5],[149,0,149,6],[150,0,150,1],[150,2,150,5],[151,0,151,1],[151,2,151,5],[152,0,152,1],[152,2,152,5],[153,0,153,1],[153,2,153,5],[143,0,143,1],[144,0,144,1],[145,0,145,1],[146,0,146,1],[147,0,147,1],[137,2,137,5],[138,2,138,5],[139,2,139,5],[140,2,140,5],[141,2,141,5],[142,2,142,5],[143,2,143,5],[144,2,144,5],[145,2,145,5],[146,2,146,5],[147,2,147,5],[135,0,135,6],[136,0,136,1],[136,2,136,5],[137,0,137,1],[138,0,138,1],[139,0,139,1],[140,0,140,1],[141,0,141,1],[142,0,142,1],[48,0,56,0],[48,1,57,1],[60,0,72,0],[60,1,72,1],[75,0,75,6],[76,0,76,1],[76,2,76,5],[0,2,0,4],[0,5,0,6],[2,3,2,5],[21,0,29,0],[32,0,45,0],[33,1,45,1],[3,0,3,1],[12,0,12,1],[80,0,80,1],[80,2,80,5],[81,0,81,1],[81,2,81,5],[82,0,82,1],[82,2,82,5],[77,0,77,1],[77,2,77,5],[78,0,78,1],[78,2,78,5],[79,0,79,1],[79,2,79,5],[86,0,86,1],[86,2,86,5],[87,0,87,1],[87,2,87,5],[88,0,88,1],[88,2,88,5],[83,0,83,1],[83,2,83,5],[84,0,84,1],[84,2,84,5],[85,0,85,1],[85,2,85,5],[93,0,93,1],[93,2,93,5],[94,0,94,1],[94,2,94,5],[95,0,95,1],[95,2,95,5],[89,0,89,1],[89,2,89,5],[90,0,90,1],[90,2,90,5],[91,0,91,6],[92,0,92,1],[92,2,92,5],[99,0,99,1],[99,2,99,5],[100,0,100,1],[100,2,100,5],[101,0,101,1],[101,2,101,5],[96,0,96,1],[96,2,96,5],[97,0,97,1],[97,2,97,5],[98,0,98,1],[98,2,98,5],[105,0,105,1],[105,2,105,5],[106,0,106,1],[106,2,106,5],[108,0,108,6],[109,0,109,1],[109,2,109,5],[102,0,102,1],[102,2,102,5],[103,0,103,1],[103,2,103,5],[104,0,104,1],[104,2,104,5],[113,0,113,1],[113,2,113,5],[114,0,114,1],[114,2,114,5],[115,0,115,1],[115,2,115,5],[110,0,110,1],[110,2,110,5],[111,0,111,1],[111,2,111,5],[112,0,112,1],[112,2,112,5],[121,0,121,1],[121,2,121,5],[122,0,122,1],[122,2,122,5],[123,0,123,1],[123,2,123,5],[116,0,116,1],[116,2,116,5],[117,0,117,1],[117,2,117,5],[119,0,119,6],[120,0,120,1],[120,2,120,5],[127,0,127,1],[127,2,127,5],[128,0,128,1],[128,2,128,5],[129,0,129,1],[129,2,129,5],[124,0,124,1],[124,2,124,5],[125,0,125,1],[125,2,125,5],[126,0,126,1],[126,2,126,5],[133,0,133,1],[133,2,133,5],[134,0,134,1],[134,2,134,5],[130,0,130,1],[130,2,130,5],[131,0,131,1],[131,2,131,5],[132,0,132,1],[132,2,132,5]]}
[null,{"$f":"_xlfn.TEXTJOIN(\"\",TRUE,C20,D20)","v":"Please SelectPlease Select"},{"$f":"E20","v":""},null,null,{"$f":"_xlfn.TEXTJOIN(\"-\",TRUE,B1,C1)","v":"Please SelectPlease Select"}]
[null,"Meter","Options"]
["Costs",{"$f":"_xlfn.IFS(B1=\"EX110B\",'Cost Data'!D154,B1=\"EX110S\",'Cost Data'!D155,B1=\"EX210B\",'Cost Data'!D156,B1=\"EX210S\",'Cost Data'!D157,B1=\"EX150B\",'Cost Data'!D158,B1=\"EX150S\",'Cost Data'!D159,B1=\"EX250B\",'Cost Data'!D160,B1=\"EX250S\",'Cost Data'!D161,B1=\"EX113B\",'Cost Data'!D162,B1=\"EX113S\",'Cost Data'!D163,B1=\"EX213B\",'Cost Data'!D164,B1=\"EX213S\",'Cost Data'!D165,B1=\"EX153B\",'Cost Data'!D166,B1=\"EX153S\",'Cost Data'!D167,B1=\"EX253B\",'Cost Data'!D168,B1=\"EX253S\",'Cost Data'!D169,B1=\"EX116B\",'Cost Data'!D170,B1=\"EX116S\",'Cost Data'!D171,B1=\"EX216B\",'Cost Data'!D172,B1=\"EX216S\",'Cost Data'!D173,B1=\"EX156B\",'Cost Data'!D174,B1=\"EX156S\",'Cost Data'!D175,B1=\"EX256B\",'Cost Data'!D176,B1=\"EX256S\",'Cost Data'!D177,B1=\"EX119B\",'Cost Data'!D178,B1=\"EX119S\",'Cost Data'!D179,B1=\"EX219B\",'Cost Data'!D180,B1=\"EX219S\",'Cost Data'!D181,B1=\"EX159B\",'Cost Data'!D182,B1=\"EX159S\",'Cost Data'!D183,B1=\"EX259B\",'Cost Data'!D184,B1=\"EX259S\",'Cost Data'!D185)","v":{"$error":"#N/A"}},{"$f":"SUM(C5:C19)","v":0},"Total",null,null,{"$f":"B3+C3","v":{"$error":"#N/A"}}]
[null,null,null,null,null,"Available Options","All Options"]
[null,null,{"$f":"_xlfn.IFS(E5=\"\",0,E5=$G$5,'Cost Data'!$D$186,E5=$G$6,'Cost Data'!$D$187,E5=$G$7,'Cost Data'!$D$188,E5=$G$8,'Cost Data'!$D$189,E5=$G$9,'Cost Data'!$D$190,E5=$G$10,'Cost Data'!$D$193,E5=$G$11,'Cost Data'!$D$194,E5=$G$12,'Cost Data'!$D$195,E5=$G$13,'Cost Data'!$D$196,E5=$G$14,'Cost Data'!$D$197,E5=$G$15,'Cost Data'!$D$198,E5=$G$16,'Cost Data'!$D$199,E5=$G$17,'Cost Data'!$D$200)","v":0},"Option 1",null,{"$f":"_xlfn.IFS(C20=\"EX110\",E22,C20=\"EX210\",E22,C20=\"EX150\",G22,C20=\"EX250\",G22, C20=\"EX113\",E34,C20=\"EX213\",E34,C20=\"EX153\",G34,C20=\"EX253\",G34, C20=\"EX116\",E49,C20=\"EX216\",E49,C20=\"EX156\",G49,C20=\"EX256\",G49, C20=\"EX119\",E61,C20=\"EX219\",E61,C20=\"EX159\",G61,C20=\"EX259\",G61,C20=\"Please Select\",\"\")","v":""},"Brass Adapter Fitting 2 inch NPT = -02",{"$f":"_xlfn.IFS(E5=\"\",\"\",E5=G5,\"02\",E5=G6,\"02\",E5=G7,\"08\",E5=G8,\"09\",E5=G9,15,E5=G10,32,E5=G11,35,E5=G12,40,E5=G13,50,E5=G14,64,E5=G15,72,E5=G16,98,E5=G17,126)","v":""}]
[null,null,{"$f":"_xlfn.IFS(E6=\"\",0,E6=$G$5,'Cost Data'!$D$186,E6=$G$6,'Cost Data'!$D$187,E6=$G$7,'Cost Data'!$D$188,E6=$G$8,'Cost Data'!$D$189,E6=$G$9,'Cost Data'!$D$190,E6=$G$10,'Cost Data'!$D$193,E6=$G$11,'Cost Data'!$D$194,E6=$G$12,'Cost Data'!$D$195,E6=$G$13,'Cost Data'!$D$196,E6=$G$14,'Cost Data'!$D$197,E6=$G$15,'Cost Data'!$D$198,E6=$G$16,'Cost Data'!$D$199,E6=$G$17,'Cost Data'!$D$200)","v":0},"Option 2",null,{"$f":"_xlfn.IFS($C$20=\"EX110\",F24,$C$20=\"EX210\",F24,$C$20=\"EX150\",G23,$C$20=\"EX250\",G23, $C$20=\"EX113\",F36,$C$20=\"EX213\",F36,$C$20=\"EX153\",G35,$C$20=\"EX253\",G35, $C$20=\"EX116\",F51,$C$20=\"EX216\",F51,$C$20=\"EX156\",G50,$C$20=\"EX256\",G50, $C$20=\"EX119\",F63,$C$20=\"EX219\",F63,$C$20=\"EX159\",G62,$C$20=\"EX259\",G62,C20=\"Please Select\",\"\")","v":""},"SS Adapter Fitting 2 inch NPT = -02",{"$f":"_xlfn.IFS(E6=\"\",\"\",E6=G5,\"02\",E6=G6,\"02\",E6=G7,\"08\",E6=G8,\"09\",E6=G9,15,E6=G10,32,E6=G11,35,E6=G12,40,E6=G13,50,E6=G14,64,E6=G15,72,E6=G16,98,E6=G17,126)","v":""}]
[null,null,{"$f":"_xlfn.IFS(E7=\"\",0,E7=$G$5,'Cost Data'!$D$186,E7=$G$6,'Cost Data'!$D$187,E7=$G$7,'Cost Data'!$D$188,E7=$G$8,'Cost Data'!$D$189,E7=$G$9,'Cost Data'!$D$190,E7=$G$10,'Cost Data'!$D$193,E7=$G$11,'Cost Data'!$D$194,E7=$G$12,'Cost Data'!$D$195,E7=$G$13,'Cost Data'!$D$196,E7=$G$14,'Cost Data'!$D$197,E7=$G$15,'Cost Data'!$D$198,E7=$G$16,'Cost Data'!$D$199,E7=$G$17,'Cost Data'!$D$200)","v":0},"Option 3",null,{"$f":"_xlfn.IFS($C$20=\"Please Select\",\"\",$C$20=\"EX110\",F25,$C$20=\"EX210\",F25,$C$20=\"EX150\",G24,$C$20=\"EX250\",G24, $C$20=\"EX113\",F37,$C$20=\"EX213\",F37,$C$20=\"EX153\",G36,$C$20=\"EX253\",G36, $C$20=\"EX116\",F52,$C$20=\"EX216\",F52,$C$20=\"EX156\",G51,$C$20=\"EX256\",G51, $C$20=\"EX119\",F64,$C$20=\"EX219\",F64,$C$20=\"EX159\",G63,$C$20=\"EX259\",G63,C19=\"Please Select\",\"\")","v":""},"316 SS Valve Assembly = -08",{"$f":"_xlfn.IFS(E7=\"\",\"\",E7=G5,\"02\",E7=G6,\"02\",E7=G7,\"08\",E7=G8,\"09\",E7=G9,15,E7=G10,32,E7=G11,35,E7=G12,40,E7=G13,50,E7=G14,64,E7=G15,72,E7=G16,98,E7=G17,126)","v":""}]
[null,null,{"$f":"_xlfn.IFS(E8=\"\",0,E8=$G$5,'Cost Data'!$D$186,E8=$G$6,'Cost Data'!$D$187,E8=$G$7,'Cost Data'!$D$188,E8=$G$8,'Cost Data'!$D$189,E8=$G$9,'Cost Data'!$D$190,E8=$G$10,'Cost Data'!$D$193,E8=$G$11,'Cost Data'!$D$194,E8=$G$12,'Cost Data'!$D$195,E8=$G$13,'Cost Data'!$D$196,E8=$G$14,'Cost Data'!$D$197,E8=$G$15,'Cost Data'!$D$198,E8=$G$16,'Cost Data'!$D$199,E8=$G$17,'Cost Data'!$D$200)","v":0},"Option 4",null,{"$f":"_xlfn.IFS($C$20=\"Please Select\",\"\",$C$20=\"EX110\",F26,$C$20=\"EX210\",F26,$C$20=\"EX150\",G25,$C$20=\"EX250\",G25, $C$20=\"EX113\",F38,$C$20=\"EX213\",F38,$C$20=\"EX153\",G37,$C$20=\"EX253\",G37, $C$20=\"EX116\",F53,$C$20=\"EX216\",F53,$C$20=\"EX156\",G52,$C$20=\"EX256\",G52, $C$20=\"EX119\",F65,$C$20=\"EX219\",F65,$C$20=\"EX159\",G64,$C$20=\"EX259\",G64,C19=\"Please Select\",\"\")","v":""},"No Valve Assembly = -09",{"$f":"_xlfn.IFS(E8=\"\",\"\",E8=G5,\"02\",E8=G6,\"02\",E8=G7,\"08\",E8=G8,\"09\",E8=G9,15,E8=G10,32,E8=G11,35,E8=G12,40,E8=G13,50,E8=G14,64,E8=G15,72,E8=G16,98,E8=G17,126)","v":""}]
[null,null,{"$f":"_xlfn.IFS(E9=\"\",0,E9=$G$5,'Cost Data'!$D$186,E9=$G$6,'Cost Data'!$D$187,E9=$G$7,'Cost Data'!$D$188,E9=$G$8,'Cost Data'!$D$189,E9=$G$9,'Cost Data'!$D$190,E9=$G$10,'Cost Data'!$D$193,E9=$G$11,'Cost Data'!$D$194,E9=$G$12,'Cost Data'!$D$195,E9=$G$13,'Cost Data'!$D$196,E9=$G$14,'Cost Data'!$D$197,E9=$G$15,'Cost Data'!$D$198,E9=$G$16,'Cost Data'!$D$199,E9=$G$17,'Cost Data'!$D$200)","v":0},"Option 5",null,{"$f":"_xlfn.IFS($C$20=\"Please Select\",\"\",$C$20=\"EX110\",F27,$C$20=\"EX210\",F27,$C$20=\"EX150\",G26,$C$20=\"EX250\",G26, $C$20=\"EX113\",F39,$C$20=\"EX213\",F39,$C$20=\"EX153\",G38,$C$20=\"EX253\",G38, $C$20=\"EX116\",F54,$C$20=\"EX216\",F54,$C$20=\"EX156\",G53,$C$20=\"EX256\",G53, $C$20=\"EX119\",F66,$C$20=\"EX219\",F66,$C$20=\"EX159\",G65,$C$20=\"EX259\",G65,C19=\"Please Select\",\"\")","v":""},"Reverse Flow Output = -15",{"$f":"_xlfn.IFS(E9=\"\",\"\",E9=G5,\"02\",E9=G6,\"02\",E9=G7,\"08\",E9=G8,\"09\",E9=G9,15,E9=G10,32,E9=G11,35,E9=G12,40,E9=G13,50,E9=G14,64,E9=G15,72,E9=G16,98,E9=G17,126)","v":""}]
[null,null,{"$f":"_xlfn.IFS(E10=\"\",0,E10=$G$5,'Cost Data'!$D$186,E10=$G$6,'Cost Data'!$D$187,E10=$G$7,'Cost Data'!$D$188,E10=$G$8,'Cost Data'!$D$189,E10=$G$9,'Cost Data'!$D$190,E10=$G$10,'Cost Data'!$D$193,E10=$G$11,'Cost Data'!$D$194,E10=$G$12,'Cost Data'!$D$195,E10=$G$13,'Cost Data'!$D$196,E10=$G$14,'Cost Data'!$D$197,E10=$G$15,'Cost Data'!$D$198,E10=$G$16,'Cost Data'!$D$199,E10=$G$17,'Cost Data'!$D$200)","v":0},"Option 6",null,{"$f":"_xlfn.IFS($C$20=\"Please Select\",\"\",$C$20=\"EX110\",\"\",$C$20=\"EX210\",F28,$C$20=\"EX150\",\"\",$C$20=\"EX250\",G27, $C$20=\"EX113\",F40,$C$20=\"EX213\",F40,$C$20=\"EX153\",G39,$C$20=\"EX253\",G39, $C$20=\"EX116\",\"\",$C$20=\"EX216\",F55,$C$20=\"EX156\",\"\",$C$20=\"EX256\",G54, $C$20=\"EX119\",F67,$C$20=\"EX219\",F67,$C$20=\"EX159\",G66,$C$20=\"EX259\",G66,C20=\"Please Select\",\"\")","v":""},"Tamper Evident Kit = -32",{"$f":"_xlfn.IFS(E10=\"\",\"\",E10=G5,\"02\",E10=G6,\"02\",E10=G7,\"08\",E10=G8,\"09\",E10=G9,15,E10=G10,32,E10=G11,35,E10=G12,40,E10=G13,50,E10=G14,64,E10=G15,72,E10=G16,98,E10=G17,126)","v":""}]
[null,null,{"$f":"_xlfn.IFS(E11=\"\",0,E11=$G$5,'Cost Data'!$D$186,E11=$G$6,'Cost Data'!$D$187,E11=$G$7,'Cost Data'!$D$188,E11=$G$8,'Cost Data'!$D$189,E11=$G$9,'Cost Data'!$D$190,E11=$G$10,'Cost Data'!$D$193,E11=$G$11,'Cost Data'!$D$194,E11=$G$12,'Cost Data'!$D$195,E11=$G$13,'Cost Data'!$D$196,E11=$G$14,'Cost Data'!$D$197,E11=$G$15,'Cost Data'!$D$198,E11=$G$16,'Cost Data'!$D$199,E11=$G$17,'Cost Data'!$D$200)","v":0},"Option 7",null,{"$f":"_xlfn.IFS($C$20=\"Please Select\",\"\",$C$20=\"EX110\",\"\",$C$20=\"EX210\",\"\",$C$20=\"EX150\",\"\",$C$20=\"EX250\",\"\", $C$20=\"EX113\",F42,$C$20=\"EX213\",F41,$C$20=\"EX153\",G41,$C$20=\"EX253\",G40, $C$20=\"EX116\",\"\",$C$20=\"EX216\",\"\",$C$20=\"EX156\",\"\",$C$20=\"EX256\",\"\", $C$20=\"EX119\",F69,$C$20=\"EX219\",F68,$C$20=\"EX159\",G68,$C$20=\"EX259\",G67,C20=\"Please Select\",\"\")","v":""},"Old Style Adapter 1.5\" NPT = -35",{"$f":"_xlfn.IFS(E11=\"\",\"\",E11=G5,\"02\",E11=G6,\"02\",E11=G7,\"08\",E11=G8,\"09\",E11=G9,15,E11=G10,32,E11=G11,35,E11=G12,40,E11=G13,50,E11=G14,64,E11=G15,72,E11=G16,98,E11=G17,126)","v":""}]
[null,null,{"$f":"_xlfn.IFS(E12=\"\",0,E12=$G$5,'Cost Data'!$D$186,E12=$G$6,'Cost Data'!$D$187,E12=$G$7,'Cost Data'!$D$188,E12=$G$8,'Cost Data'!$D$189,E12=$G$9,'Cost Data'!$D$190,E12=$G$10,'Cost Data'!$D$193,E12=$G$11,'Cost Data'!$D$194,E12=$G$12,'Cost Data'!$D$195,E12=$G$13,'Cost Data'!$D$196,E12=$G$14,'Cost Data'!$D$197,E12=$G$15,'Cost Data'!$D$198,E12=$G$16,'Cost Data'!$D$199,E12=$G$17,'Cost Data'!$D$200)","v":0},"Option 8",null,{"$f":"_xlfn.IFS($C$20=\"EX110\",\"\",$C$20=\"EX210\",\"\",$C$20=\"EX150\",\"\",$C$20=\"EX250\",\"\", $C$20=\"EX113\",F43,$C$20=\"EX213\",F42,$C$20=\"EX153\",G42,$C$20=\"EX253\",G41, $C$20=\"EX116\",\"\",$C$20=\"EX216\",\"\",$C$20=\"EX156\",\"\",$C$20=\"EX256\",\"\", $C$20=\"EX119\",F70,$C$20=\"EX219\",F69,$C$20=\"EX159\",G69,$C$20=\"EX259\",G68,C20=\"Please Select\",\"\")","v":""},"*Immersible = -40",{"$f":"_xlfn.IFS(E12=\"\",\"\",E12=G5,\"02\",E12=G6,\"02\",E12=G7,\"08\",E12=G8,\"09\",E12=G9,15,E12=G10,32,E12=G11,35,E12=G12,40,E12=G13,50,E12=G14,64,E12=G15,72,E12=G16,98,E12=G17,126)","v":""}]
[null,null,{"$f":"_xlfn.IFS(E13=\"\",0,E13=$G$5,'Cost Data'!$D$186,E13=$G$6,'Cost Data'!$D$187,E13=$G$7,'Cost Data'!$D$188,E13=$G$8,'Cost Data'!$D$189,E13=$G$9,'Cost Data'!$D$190,E13=$G$10,'Cost Data'!$D$193,E13=$G$11,'Cost Data'!$D$194,E13=$G$12,'Cost Data'!$D$195,E13=$G$13,'Cost Data'!$D$196,E13=$G$14,'Cost Data'!$D$197,E13=$G$15,'Cost Data'!$D$198,E13=$G$16,'Cost Data'!$D$199,E13=$G$17,'Cost Data'!$D$200)","v":0},"Option 9",null,{"$f":"_xlfn.IFS($C$20=\"EX110\",\"\",$C$20=\"EX210\",\"\",$C$20=\"EX150\",\"\",$C$20=\"EX250\",\"\", $C$20=\"EX113\",\"\",$C$20=\"EX213\",F43,$C$20=\"EX153\",\"\",$C$20=\"EX253\",G42, $C$20=\"EX116\",\"\",$C$20=\"EX216\",\"\",$C$20=\"EX156\",\"\",$C$20=\"EX256\",\"\", $C$20=\"EX119\",\"\",$C$20=\"EX219\",F70,$C$20=\"EX159\",\"\",$C$20=\"EX259\",G69,C20=\"Please Select\",\"\")","v":""},"Low Power = -50",{"$f":"_xlfn.IFS(E13=\"\",\"\",E13=G5,\"02\",E13=G6,\"02\",E13=G7,\"08\",E13=G8,\"09\",E13=G9,15,E13=G10,32,E13=G11,35,E13=G12,40,E13=G13,50,E13=G14,64,E13=G15,72,E13=G16,98,E13=G17,126)","v":""}]
[null,null,null,null,null,null,"Non-resettable Total = 64",{"$f":"_xlfn.IFS(E14=\"\",\"\",E14=G5,\"02\",E14=G6,\"02\",E14=G7,\"08\",E14=G8,\"09\",E14=G9,15,E14=G10,32,E14=G11,35,E14=G12,40,E14=G13,50,E14=G14,64,E14=G15,72,E14=G16,98,E14=G17,126)","v":""}]
[null,null,null,null,null,null,"12 inch Extension = -72",{"$f":"_xlfn.IFS(E15=\"\",\"\",E15=G5,\"02\",E15=G6,\"02\",E15=G7,\"08\",E15=G8,\"09\",E15=G9,15,E15=G10,32,E15=G11,35,E15=G12,40,E15=G13,50,E15=G14,64,E15=G15,72,E15=G16,98,E15=G17,126)","v":""}]
[null,null,null,null,null,null,"Dual Relay Output = 98",{"$f":"_xlfn.IFS(E16=\"\",\"\",E16=G5,\"02\",E16=G6,\"02\",E16=G7,\"08\",E16=G8,\"09\",E16=G9,15,E16=G10,32,E16=G11,35,E16=G12,40,E16=G13,50,E16=G14,64,E16=G15,72,E16=G16,98,E16=G17,126)","v":""}]
[null,null,null,null,null,null,"Hinged Display Cover = -126",{"$f":"_xlfn.IFS(E17=\"\",\"\",E17=G5,\"02\",E17=G6,\"02\",E17=G7,\"08\",E17=G8,\"09\",E17=G9,15,E17=G10,32,E17=G11,35,E17=G12,40,E17=G13,50,E17=G14,64,E17=G15,72,E17=G16,98,E17=G17,126)","v":""}]
["Start"]
["Here"]
[null,null,"Please Select","Please Select",{"$f":"_xlfn.TEXTJOIN(\"-\",TRUE,H5,H6,H7,H8,H9,H10,H11,H12,H13,H15,H16,H17,H18,H19)","v":""}]
[null,"Description","Size","Sensor Material",null,"EX110/EX210","EX150/EX250"]
["Sensor Only","Externally Powered","3” – 10” pipe = EX110","Brass = B",{"$f":"_xlfn.IFS(D20=\"B\",F22,D20=\"S\",F23, D20=\"Please Select\", \"\")","v":""},"Brass Adapter Fitting 2 inch NPT = -02","316 SS Valve Assembly = -08"]
[null,"(12 - 24vdc) Sensor only.","10” – 48” pipe = EX210","316 Stainless = S",{"$f":"_xlfn.IFS(D20=\"B\",F25,D20=\"S\",F26, D20=\"Please Select\", \"\")","v":""},"SS Adapter Fitting 2 inch NPT = -02","No Valve Assembly = -09"]
[null,null,"Hot Tap 3” – 10” pipe = EX150 ",null,null,"Reverse Flow Output = -15","Reverse Flow Output = -15"]
[null,null,"Hot Tap 10” – 48” pipe = EX250",null,null,"Old Style Adapter 1.5\" NPT = -35","*Immersible = -40"]
[null,null,null,null,null,"*Immersible = -40","Low Power = -50"]
[null,null,null,null,null,"Low Power = -50","12 inch Extension = -72"]
[null,null,null,null,null,"12 inch Extension = -72"]
[]
[]
[]
[]
["FT430 Mounted on Sensor","Description","Size","Sensor Material",null,"EX113/EX213","EX153/EX253"]
[null,"Externally powered sensor (12 - 24Vdc) with FT430 rate and total indicator (with pulse outputs) mounted on the sensor.","3” – 10” pipe = EX113","Brass = B",{"$f":"_xlfn.IFS(D20=\"B\",F34,D20=\"S\",F35)","v":{"$error":"#N/A"}},"Brass Adapter Fitting 2 inch NPT = -02","316 SS Valve Assembly = -08"]
[null,null,"10” – 48” pipe = EX213","316 Stainless = S",null,"SS Adapter Fitting 2 inch NPT = -02","No Valve Assembly = -09"]
[null,null,"Hot Tap 3” – 10” pipe = EX153",null,null,"Reverse Flow Output = -15","Reverse Flow Output = -15"]
[null,null,"Hot Tap 10” – 48” pipe = EX253",null,null,"Tamper Evident Kit = -32","Tamper Evident Kit = -32"]
[null,null,null,null,null,"Old Style Adapter 1.5\" NPT = -35","Low Power = -50"]
[null,null,null,null,null,"Low Power = -50","Non-resettable Total = 64"]
[null,null,null,null,null,"Non-resettable Total = 64","12 inch Extension = -72"]
[null,null,null,null,null,"12 inch Extension = -72","Dual Relay Output = 98"]
[null,null,null,null,null,"Dual Relay Output = 98","Hinged Display Cover = -126"]
[null,null,null,null,null,"Hinged Display Cover = -126"]
[]
[]
[]
[]
[null,"Description","Size","Sensor Material",null,"EX116/EX216","EX156/EX256"]
["DL76 Mounted on Sensor","Externally powered sensor (12 - 24vdc) with self powered DL76 data logger mounted on the sensor.","3” – 10” pipe = EX116","Brass = B",{"$f":"_xlfn.IFS(D20=\"B\",F49,D20=\"S\",F50)","v":{"$error":"#N/A"}},"Brass Adapter Fitting 2 inch NPT = -02","316 SS Valve Assembly = -08"]
[null,null,"10” – 48” pipe = EX216","316 Stainless = S",null,"SS Adapter Fitting 2 inch NPT = -02","No Valve Assembly = -09"]
[null,null,"Hot Tap 3” – 10” pipe = EX156",null,null,"Reverse Flow Output = -15","Reverse Flow Output = -15"]
[null,null,"Hot Tap 10” – 48” pipe = EX256",null,null,"Tamper Evident Kit = -32","Tamper Evident Kit = -32"]
[null,null,null,null,null,"Old Style Adapter 1.5\" NPT = -35","Low Power = -50"]
[null,null,null,null,null,"Low Power = -50","12 inch Extension = -72"]
[null,null,null,null,null,"12 inch Extension = -72"]
[]
[]
[]
[]
[null,"Description","Size","Sensor Material",null,"EX119/EX219","EX159/EX259"]
["FT440 Mounted        on Sensor","Externally powered sensor (12 - 24Vdc) with FT440 rate and total indicator (with pulse and 4-20mA outputs) mounted on the sensor.","3” – 10” pipe = EX119","Brass = B",{"$f":"_xlfn.IFS(D20=\"B\",F61,D20=\"S\",F62)","v":{"$error":"#N/A"}},"Brass Adapter Fitting 2 inch NPT = -02","316 SS Valve Assembly = -08"]
[null,null,"10” – 48” pipe = EX219","316 Stainless = S",null,"SS Adapter Fitting 2 inch NPT = -02","No Valve Assembly = -09"]
[null,null,"Hot Tap 3” – 10” pipe = EX159",null,null,"Reverse Flow Output = -15","Reverse Flow Output = -15"]
[null,null,"Hot Tap 10” – 48” pipe = EX259",null,null,"Tamper Evident Kit = -32","Tamper Evident Kit = -32"]
[null,null,null,null,null,"Old Style Adapter 1.5\" NPT = -35","Low Power = -50"]
[null,null,null,null,null,"Low Power = -50","Non-resettable Total = 64"]
[null,null,null,null,null,"Non-resettable Total = 64","12 inch Extension = -72"]
[null,null,null,null,null,"12 inch Extension = -72","Dual Relay Output = 98"]
[null,null,null,null,null,"Dual Relay Output = 98","Hinged Display Cover = -126"]
[null,null,null,null,null,"Hinged Display Cover = -126"]
[]
[]
[]
[]
[]
["EX110/210 Series Saddle Fittings"]
["Model #",null,"Description",null,null,null,"Price"]
["MF101F-300-150",null,"Saddle, Iron, NPT Thread, 3\" X 1-1/2\" (3.45 - 4.05 O.D. range)",null,null,null,{"$f":"'Cost Data'!D202","v":378}]
["MF101F-400-150",null,"Saddle, Iron, NPT Thread, 4\" X 1-1/2\" (4.00 - 4.50 O.D. range)","Saddle, Iron, NPT Thread, 4\" X 1-1/2\" (4.00 - 4.50 O.D. range)","Saddle, Iron, NPT Thread, 4\" X 1-1/2\" (4.00 - 4.50 O.D. range)","Saddle, Iron, NPT Thread, 4\" X 1-1/2\" (4.00 - 4.50 O.D. range)",{"$f":"'Cost Data'!D203","v":231}]
["MF101F-600-150",null,"Saddle, Iron, NPT Thread, 6\" X 1-1/2\" (6.00 - 6.63 O.D. range)","Saddle, Iron, NPT Thread, 6\" X 1-1/2\" (6.00 - 6.63 O.D. range)","Saddle, Iron, NPT Thread, 6\" X 1-1/2\" (6.00 - 6.63 O.D. range)","Saddle, Iron, NPT Thread, 6\" X 1-1/2\" (6.00 - 6.63 O.D. range)",{"$f":"'Cost Data'!D204","v":238}]
["MF101F-800-150",null,"Saddle, Iron, NPT Thread, 8\" X 1-1/2\" (8.00 - 8.63 O.D. range)","Saddle, Iron, NPT Thread, 8\" X 1-1/2\" (8.00 - 8.63 O.D. range)","Saddle, Iron, NPT Thread, 8\" X 1-1/2\" (8.00 - 8.63 O.D. range)","Saddle, Iron, NPT Thread, 8\" X 1-1/2\" (8.00 - 8.63 O.D. range)",{"$f":"'Cost Data'!D205","v":285}]
["MF101F-1000-150",null,"Saddle, Iron, NPT Thread, 10\" X 1-1/2\" (10.00 - 11.10 O.D. range) ","Saddle, Iron, NPT Thread, 10\" X 1-1/2\" (10.00 - 11.10 O.D. range) ","Saddle, Iron, NPT Thread, 10\" X 1-1/2\" (10.00 - 11.10 O.D. range) ","Saddle, Iron, NPT Thread, 10\" X 1-1/2\" (10.00 - 11.10 O.D. range) ",{"$f":"'Cost Data'!D206","v":397}]
["MF101F-1200-150",null,"Saddle, Iron, NPT Thread, 12\" X 1-1/2\" (12.00 - 13.20 O.D. range) ","Saddle, Iron, NPT Thread, 12\" X 1-1/2\" (12.00 - 13.20 O.D. range) ","Saddle, Iron, NPT Thread, 12\" X 1-1/2\" (12.00 - 13.20 O.D. range) ","Saddle, Iron, NPT Thread, 12\" X 1-1/2\" (12.00 - 13.20 O.D. range) ",{"$f":"'Cost Data'!D207","v":491}]
["MF101F-1400-150",null,"Saddle, Iron, NPT Thread, 14\" X 1-1/2\" (15.30 - 16.80 O.D. range) ","Saddle, Iron, NPT Thread, 14\" X 1-1/2\" (15.30 - 16.80 O.D. range) ","Saddle, Iron, NPT Thread, 14\" X 1-1/2\" (15.30 - 16.80 O.D. range) ","Saddle, Iron, NPT Thread, 14\" X 1-1/2\" (15.30 - 16.80 O.D. range) ",{"$f":"'Cost Data'!D208","v":702}]
["MF101F-1600-150",null,"Saddle, Iron, NPT Thread, 16\" X 1-1/2\"(17.40 - 18.90 O.D. range) ","Saddle, Iron, NPT Thread, 16\" X 1-1/2\"(17.40 - 18.90 O.D. range) ","Saddle, Iron, NPT Thread, 16\" X 1-1/2\"(17.40 - 18.90 O.D. range) ","Saddle, Iron, NPT Thread, 16\" X 1-1/2\"(17.40 - 18.90 O.D. range) ",{"$f":"'Cost Data'!D209","v":756}]
["MF101F-1800-150",null,"Saddle, Iron, NPT Thread, 18\" X 1-1/2\"(19.50 - 21.10 O.D. range) ","Saddle, Iron, NPT Thread, 18\" X 1-1/2\"(19.50 - 21.10 O.D. range) ","Saddle, Iron, NPT Thread, 18\" X 1-1/2\"(19.50 - 21.10 O.D. range) ","Saddle, Iron, NPT Thread, 18\" X 1-1/2\"(19.50 - 21.10 O.D. range) ",{"$f":"'Cost Data'!D210","v":992}]
["MF101F-2000-150",null,"Saddle, Iron, NPT Thread, 20\" X 1-1/2\"(21.10 - 22.70 O.D. range) ","Saddle, Iron, NPT Thread, 20\" X 1-1/2\"(21.10 - 22.70 O.D. range) ","Saddle, Iron, NPT Thread, 20\" X 1-1/2\"(21.10 - 22.70 O.D. range) ","Saddle, Iron, NPT Thread, 20\" X 1-1/2\"(21.10 - 22.70 O.D. range) ",{"$f":"'Cost Data'!D211","v":1235}]
["MF101F-2200-150",null,"Saddle, Iron, NPT Thread, 22\" X 1-1/2\"(22.70 - 24.30 O.D. range) ","Saddle, Iron, NPT Thread, 22\" X 1-1/2\"(22.70 - 24.30 O.D. range) ","Saddle, Iron, NPT Thread, 22\" X 1-1/2\"(22.70 - 24.30 O.D. range) ","Saddle, Iron, NPT Thread, 22\" X 1-1/2\"(22.70 - 24.30 O.D. range) ",{"$f":"'Cost Data'!D212","v":1243}]
["MF101F-2400-150",null,"Saddle, Iron, NPT Thread, 24\" X 1-1/2\"(24.30 - 25.90 O.D. range) ","Saddle, Iron, NPT Thread, 24\" X 1-1/2\"(24.30 - 25.90 O.D. range) ","Saddle, Iron, NPT Thread, 24\" X 1-1/2\"(24.30 - 25.90 O.D. range) ","Saddle, Iron, NPT Thread, 24\" X 1-1/2\"(24.30 - 25.90 O.D. range) ",{"$f":"'Cost Data'!D213","v":1361}]
["MF101B-400-150",null,"Saddle, Brass, NPT Thread 4\" X 1-1/2\"","Saddle, Brass, NPT Thread 4\" X 1-1/2\"","Saddle, Brass, NPT Thread 4\" X 1-1/2\"","Saddle, Brass, NPT Thread 4\" X 1-1/2\"",{"$f":"'Cost Data'!D214","v":450}]
[]
["EX150/250 Series Saddle Fittings"]
["Model #",null,"Description",null,null,null,"Price"]
["MF101F-300-200",null,"Saddle, Iron, NPT Thread, 3\" X 2\" (3.45 - 4.05 O.D. range)",null,null,null,{"$f":"'Cost Data'!D216","v":378}]
["MF101F-400-200",null,"Saddle, Iron, NPT Thread, 4\" X 2\" (4.00 - 4.50 O.D. range)",null,null,null,{"$f":"'Cost Data'!D217","v":231}]
["MF101F-600-200",null,"Saddle, Iron, NPT Thread, 6\" X 2\" (6.00 - 6.63 O.D. range)",null,null,null,{"$f":"'Cost Data'!D218","v":238}]
["MF101F-800-200",null,"Saddle, Iron, NPT Thread, 8\" X 2\" (8.00 - 8.63 O.D. range)",null,null,null,{"$f":"'Cost Data'!D219","v":285}]
["MF101F-1000-200",null,"Saddle, Iron, NPT Thread, 10\" X 2\" (10.00 - 11.10 O.D. range)",null,null,null,{"$f":"'Cost Data'!D220","v":397}]
["MF101F-1200-200",null,"Saddle, Iron, NPT Thread, 12\" X 2\" (12.00 - 13.20 O.D. range)",null,null,null,{"$f":"'Cost Data'!D221","v":491}]
["MF101F-1400-200",null,"Saddle, Iron, NPT Thread, 14\" X 2\" (15.30 - 16.80 O.D. range)",null,null,null,{"$f":"'Cost Data'!D222","v":702}]
["MF101F-1600-200",null,"Saddle, Iron, NPT Thread, 16\" X 2\"(17.40 - 18.90 O.D. range)",null,null,null,{"$f":"'Cost Data'!D223","v":756}]
["MF101F-1800-200",null,"Saddle, Iron, NPT Thread, 18\" X 2\"(19.50 - 21.10 O.D. range)",null,null,null,{"$f":"'Cost Data'!D224","v":992}]
["MF101F-2000-200",null,"Saddle, Iron, NPT Thread, 20\" X 2\"(21.10 - 22.70 O.D. range)",null,null,null,{"$f":"'Cost Data'!D225","v":1188}]
["MF101F-2200-200",null,"Saddle, Iron, NPT Thread, 22\" X 2\"(22.70 - 24.30 O.D. range)",null,null,null,{"$f":"'Cost Data'!D226","v":1243}]
["MF101F-2400-200",null,"Saddle, Iron, NPT Thread, 24\" X 2\"(24.30 - 25.90 O.D. range)",null,null,null,{"$f":"'Cost Data'!D227","v":1361}]
["MF101B-300-200",null,"Saddle, Brass, NPT Thread, 3\" X 2\" ",null,null,null,{"$f":"'Cost Data'!D228","v":455}]
["MF101B-400-200",null,"Saddle, Brass, NPT Thread, 4\" X 2\" ",null,null,null,{"$f":"'Cost Data'!D229","v":520}]
[]
["EX110/210 Series Parts & Accessories"]
["Model #",null,"Description",null,null,null,"Price"]
[101850,null,"Strain Relief Kit Large, 1/2\", NPT",null,null,null,{"$f":"'Cost Data'!D231","v":21}]
[100411,null,"Gasket, Upper Housing ",null,null,null,{"$f":"'Cost Data'!D232","v":16}]
[102021,102021,"Hinged Display Cover Kit","Hinged Display Cover Kit","Hinged Display Cover Kit","Hinged Display Cover Kit",{"$f":"'Cost Data'!D233","v":64}]
[100662,100662,"Housing Assy, Upper, Blind (Gasket, Screws, Washers, Label) ","Housing Assy, Upper, Blind (Gasket, Screws, Washers, Label) ","Housing Assy, Upper, Blind (Gasket, Screws, Washers, Label) ","Housing Assy, Upper, Blind (Gasket, Screws, Washers, Label) ",{"$f":"'Cost Data'!D234","v":63}]
[103702,103702,"White Housing Screw/Washer Kit","White Housing Screw/Washer Kit","White Housing Screw/Washer Kit","White Housing Screw/Washer Kit",{"$f":"'Cost Data'!D235","v":4}]
[100414,100414,"Screw/Washer Kit, Upper Housing (Qty 4)","Screw/Washer Kit, Upper Housing (Qty 4)","Screw/Washer Kit, Upper Housing (Qty 4)","Screw/Washer Kit, Upper Housing (Qty 4)",{"$f":"'Cost Data'!D236","v":3}]
[100853,100853,"Security Seal, w/12\" of Wire ","Security Seal, w/12\" of Wire ","Security Seal, w/12\" of Wire ","Security Seal, w/12\" of Wire ",{"$f":"'Cost Data'!D237","v":5}]
[100854,100854,"Wire, for Security Seal, 12\" (For 3\" Only)","Wire, for Security Seal, 12\" (For 3\" Only)","Wire, for Security Seal, 12\" (For 3\" Only)","Wire, for Security Seal, 12\" (For 3\" Only)",{"$f":"'Cost Data'!D238","v":3}]
[]
["EX150/250 Series Parts & Accessories"]
["Model #",null,"Description",null,null,null,"Price"]
[101850,101850,"Strain Relief Kit Large, 1/2\", NPT","Strain Relief Kit Large, 1/2\", NPT","Strain Relief Kit Large, 1/2\", NPT","Strain Relief Kit Large, 1/2\", NPT",{"$f":"'Cost Data'!D240","v":21}]
[100411,100411,"Gasket, Upper Housing ","Gasket, Upper Housing ","Gasket, Upper Housing ","Gasket, Upper Housing ",{"$f":"'Cost Data'!D241","v":16}]
[102021,102021,"Hinged Display Cover Kit","Hinged Display Cover Kit","Hinged Display Cover Kit","Hinged Display Cover Kit",{"$f":"'Cost Data'!D242","v":64}]
[100662,100662,"Housing Assy, Upper, Blind (Gasket, Screws, Washers, Label)","Housing Assy, Upper, Blind (Gasket, Screws, Washers, Label)","Housing Assy, Upper, Blind (Gasket, Screws, Washers, Label)","Housing Assy, Upper, Blind (Gasket, Screws, Washers, Label)",{"$f":"'Cost Data'!D243","v":63}]
[103702,103702,"White Housing Screw/Washer Kit","White Housing Screw/Washer Kit","White Housing Screw/Washer Kit","White Housing Screw/Washer Kit",{"$f":"'Cost Data'!D244","v":4}]
[100345,100345,"O-Ring, EPDM, Black","O-Ring, EPDM, Black","O-Ring, EPDM, Black","O-Ring, EPDM, Black",{"$f":"'Cost Data'!D245","v":17}]
[100414,100414,"Screw/Washer Kit, Upper Housing (Qty 4) ","Screw/Washer Kit, Upper Housing (Qty 4) ","Screw/Washer Kit, Upper Housing (Qty 4) ","Screw/Washer Kit, Upper Housing (Qty 4) ",{"$f":"'Cost Data'!D246","v":3}]
[100853,100853,"Security Seal, w/12\" of Wire ","Security Seal, w/12\" of Wire ","Security Seal, w/12\" of Wire ","Security Seal, w/12\" of Wire ",{"$f":"'Cost Data'!D247","v":5}]
[100069,100069,"Valve Assembly, Brass, Hot-Tap ","Valve Assembly, Brass, Hot-Tap ","Valve Assembly, Brass, Hot-Tap ","Valve Assembly, Brass, Hot-Tap ",{"$f":"'Cost Data'!D248","v":299}]
[100119,100119,"Valve Assembly, 316 SS, Hot-Tap","Valve Assembly, 316 SS, Hot-Tap","Valve Assembly, 316 SS, Hot-Tap","Valve Assembly, 316 SS, Hot-Tap",{"$f":"'Cost Data'!D249","v":718}]
[100854,100854,"Wire, for Security Seal, 12\" (For 3\" Only)","Wire, for Security Seal, 12\" (For 3\" Only)","Wire, for Security Seal, 12\" (For 3\" Only)","Wire, for Security Seal, 12\" (For 3\" Only)",{"$f":"'Cost Data'!D250","v":3}]
[100066,100066,"Nipple, Close, Thd, Brass, 2\" ","Nipple, Close, Thd, Brass, 2\" ","Nipple, Close, Thd, Brass, 2\" ","Nipple, Close, Thd, Brass, 2\" ",{"$f":"'Cost Data'!D251","v":81}]
[100103,100103,"Nipple, Close, 316 SS, 2\"","Nipple, Close, 316 SS, 2\"","Nipple, Close, 316 SS, 2\"","Nipple, Close, 316 SS, 2\"",{"$f":"'Cost Data'!D252","v":97}]
[]
["Cables & Connectors"]
["Model #",null,"Description",null,null,null,"Price"]
[100852,null,"Cable, Shielded, 4-Con, EX W/O Reverse Flow (Per Ft.)",null,null,null,{"$f":"'Cost Data'!D898","v":5}]
[100835,null,"Cable, Shielded, 6-Con, EX W/ Reverse Flow (Per Ft.)",null,null,null,{"$f":"'Cost Data'!D899","v":6}]
[100010,null,"Cable, Unshielded, 2 Con, MJ-WJ-AO55 (Per Ft.)",null,null,null,{"$f":"'Cost Data'!D900","v":3}]
[100451,null,"Cable, Unshielded, 3 Con, Blue, Low Power, IP-TX-WT-S Series (Per Ft.)",null,null,null,{"$f":"'Cost Data'!D901","v":3}]
[100011,null,"Cable, Unshielded, 3 Con, Grey Micropower (IP,TX,WT,SPX,SPT,SES)",null,null,null,{"$f":"'Cost Data'!D902","v":3}]
[100014,null,"Cable, Unshielded, 4 Con, FT440, (Per Ft.)",null,null,null,{"$f":"'Cost Data'!D903","v":4}]
[100649,null,"Cable, Unshielded, 3 Con, MJE (Per Ft.)",null,null,null,{"$f":"'Cost Data'!D904","v":3}]
[100008,null,"Connector, Female, LMI 4pin, Female",null,null,null,{"$f":"'Cost Data'!D905","v":40}]
[100006,null,"Connector, Seametrics 3-Pin BulkHead",null,null,null,{"$f":"'Cost Data'!D906","v":40}]
[100007,null,"Connector, Seametrics 3-Pin Cable End",null,null,null,{"$f":"'Cost Data'!D907","v":40}]
[101783,null,"Roytronics® Series-A Pump 5 Pin Connector",null,null,null,{"$f":"'Cost Data'!D908","v":41}]
[]
["Cables & Connectors Assemblies"]
["Model #",null,"Description",null,null,null,"Price"]
[100039,null,"Cable Assy, 12' Unshielded, 2 Con, LMI 4-Pin Connector",null,null,null,{"$f":"'Cost Data'!D910","v":54}]
[100013,null,"Cable Assy, 12' Unshielded, 3 Con, LMI 4-Pin Connector, 1K Resistor","Cable Assy, 12' Unshielded, 3 Con, LMI 4-Pin Connector, 1K Resistor","Cable Assy, 12' Unshielded, 3 Con, LMI 4-Pin Connector, 1K Resistor","Cable Assy, 12' Unshielded, 3 Con, LMI 4-Pin Connector, 1K Resistor",{"$f":"'Cost Data'!D911","v":54}]
[100395,null,"Cable Assy, 12' Unshielded, 2 Con, Seametrics 3-Pin Connector","Cable Assy, 12' Unshielded, 2 Con, Seametrics 3-Pin Connector","Cable Assy, 12' Unshielded, 2 Con, Seametrics 3-Pin Connector","Cable Assy, 12' Unshielded, 2 Con, Seametrics 3-Pin Connector",{"$f":"'Cost Data'!D912","v":54}]
[100041,null,"Cable Assy, 12' Unshielded, 3 Con, Seametrics 3-Pin Connector","Cable Assy, 12' Unshielded, 3 Con, Seametrics 3-Pin Connector","Cable Assy, 12' Unshielded, 3 Con, Seametrics 3-Pin Connector","Cable Assy, 12' Unshielded, 3 Con, Seametrics 3-Pin Connector",{"$f":"'Cost Data'!D913","v":54}]
[101587,null,"Cable Assy, 12' Unshielded, 2 Con, LMI 5-Pin Connector","Cable Assy, 12' Unshielded, 2 Con, LMI 5-Pin Connector","Cable Assy, 12' Unshielded, 2 Con, LMI 5-Pin Connector","Cable Assy, 12' Unshielded, 2 Con, LMI 5-Pin Connector",{"$f":"'Cost Data'!D914","v":54}]
[101576,null,"Cable Assy, 12' Unshielded, 3 Con, LMI 5-Pin Connector","Cable Assy, 12' Unshielded, 3 Con, LMI 5-Pin Connector","Cable Assy, 12' Unshielded, 3 Con, LMI 5-Pin Connector","Cable Assy, 12' Unshielded, 3 Con, LMI 5-Pin Connector",{"$f":"'Cost Data'!D915","v":54}]
[100044,null,"Sensor Assy, MJR, Single Reed Switch, LMI Pump 4-Pin Connector","Sensor Assy, MJR, Single Reed Switch, LMI Pump 4-Pin Connector","Sensor Assy, MJR, Single Reed Switch, LMI Pump 4-Pin Connector","Sensor Assy, MJR, Single Reed Switch, LMI Pump 4-Pin Connector",{"$f":"'Cost Data'!D916","v":113}]
[100045,null,"Sensor Assy, MJR, Dual Reed Switch, LMI Pump 4-Pin Connector","Sensor Assy, MJR, Dual Reed Switch, LMI Pump 4-Pin Connector","Sensor Assy, MJR, Dual Reed Switch, LMI Pump 4-Pin Connector","Sensor Assy, MJR, Dual Reed Switch, LMI Pump 4-Pin Connector",{"$f":"'Cost Data'!D917","v":123}]
[100049,null,"Sensor Assy, MJE, Single Hall Effect, LMI Pump 4-Pin Connector","Sensor Assy, MJE, Single Hall Effect, LMI Pump 4-Pin Connector","Sensor Assy, MJE, Single Hall Effect, LMI Pump 4-Pin Connector","Sensor Assy, MJE, Single Hall Effect, LMI Pump 4-Pin Connector",{"$f":"'Cost Data'!D918","v":113}]
[100046,null,"Sensor Assy, MJR, Single Reed Switch, Seametrics Control Connector","Sensor Assy, MJR, Single Reed Switch, Seametrics Control Connector","Sensor Assy, MJR, Single Reed Switch, Seametrics Control Connector","Sensor Assy, MJR, Single Reed Switch, Seametrics Control Connector",{"$f":"'Cost Data'!D919","v":113}]
[100047,null,"Sensor Assy, MJR, Dual Reed Switch, Seametrics Control Connector","Sensor Assy, MJR, Dual Reed Switch, Seametrics Control Connector","Sensor Assy, MJR, Dual Reed Switch, Seametrics Control Connector","Sensor Assy, MJR, Dual Reed Switch, Seametrics Control Connector",{"$f":"'Cost Data'!D920","v":123}]
[100048,null,"Sensor Assy, MJE, Single Hall Effect, Seametrics Control Cable","Sensor Assy, MJE, Single Hall Effect, Seametrics Control Cable","Sensor Assy, MJE, Single Hall Effect, Seametrics Control Cable","Sensor Assy, MJE, Single Hall Effect, Seametrics Control Cable",{"$f":"'Cost Data'!D921","v":113}]
[101588,null,"Sensor Assy, MJR, Single Reed Switch, LMI Pump 5-Pin Connector","Sensor Assy, MJR, Single Reed Switch, LMI Pump 5-Pin Connector","Sensor Assy, MJR, Single Reed Switch, LMI Pump 5-Pin Connector","Sensor Assy, MJR, Single Reed Switch, LMI Pump 5-Pin Connector",{"$f":"'Cost Data'!D922","v":113}]
[101589,null,"Sensor Assy, MJR, Dual Reed SW, LMI Pump 5-Pin Connector","Sensor Assy, MJR, Dual Reed SW, LMI Pump 5-Pin Connector","Sensor Assy, MJR, Dual Reed SW, LMI Pump 5-Pin Connector","Sensor Assy, MJR, Dual Reed SW, LMI Pump 5-Pin Connector",{"$f":"'Cost Data'!D923","v":113}]
[101590,null,"Sensor Assy, MJE, Single Hall Effect, LMI Pump 5-Pin Connector","Sensor Assy, MJE, Single Hall Effect, LMI Pump 5-Pin Connector","Sensor Assy, MJE, Single Hall Effect, LMI Pump 5-Pin Connector","Sensor Assy, MJE, Single Hall Effect, LMI Pump 5-Pin Connector",{"$f":"'Cost Data'!D924","v":123}]

{"sheet":"Config Pick Data","index":4,"n_rows":51,"n_cols":23,"rows_kept":51,"cut":false,"hidden":true,"merged":[[19,0,20,0],[21,0,22,0],[25,0,27,0],[32,0,33,0]]}
[null,"Base","Quality"," Water Type",null,"Mag Meters","Paddle Wheels","Turbines",null,null,"Temp","Temp","Press","Straight Runs","Size","Water Oil","Dirty","Not DI","NSF","Go No Go",null,"Meter"]
[null,"Water","Clean","Fresh","N/A","PE202","SPX","WTS",null,null,"130F",{"$f":"IF(('Interactive Form'!B11<131), \"1\", \"0\")","v":"1"},{"$f":"IF(('Interactive Form'!B12<151), \"1\", \"0\")","v":"1"},{"$f":"IF((AND('Interactive Form'!B16>9, 'Interactive Form'!B17>4)), \"1\", \"0\")","v":"0"},{"$f":"IF((AND('Interactive Form'!B13>0.99, 'Interactive Form'!B13<12.1)), \"1\", \"0\")","v":"0"},{"$f":"IF(('Interactive Form'!B10<>\"Oil\"), \"1\", \"0\")","v":"1"},{"$f":"IF(OR('Interactive Form'!C10=\"Dirty\",'Interactive Form'!C10=\"Clean\"), \"1\", \"0\")","v":"0"},{"$f":"IF('Interactive Form'!D10<>\"DI\", \"1\", \"0\")","v":"1"},{"$f":"IF('Interactive Form'!D10=D5, \"0\", \"1\")","v":"1"},{"$f":"(L2*M2*N2*O2*P2*Q2*R2*S2)","v":0},{"$f":"IF(T2=1, \"x\", \"\")","v":""},"EX800P",{"$f":"IF((AND(L2=\"X\", M2=\"X\", N2=\"X\")), \"Z\", \"\")","v":""}]
[null,"Oil","Dirty","Salt",null,"WMP","SES","WTP",null,null,"130F",{"$f":"IF(('Interactive Form'!B11<131), \"1\", \"0\")","v":"1"},{"$f":"IF(('Interactive Form'!B12<176), \"1\", \"0\")","v":"1"},{"$f":"IF((AND('Interactive Form'!B16>9, 'Interactive Form'!B17>4)), \"1\", \"0\")","v":"0"},{"$f":"IF((OR('Interactive Form'!B13=0.5, 'Interactive Form'!B13=0.75, 'Interactive Form'!B13=1, 'Interactive Form'!B13=1.5, 'Interactive Form'!B13=2, 'Interactive Form'!B13=3, 'Interactive Form'!B13=4, 'Interactive Form'!B13=6, 'Interactive Form'!B13=8)), \"1\", \"0\")","v":"0"},{"$f":"IF(OR('Interactive Form'!B10=\"Water\",'Interactive Form'!B10=\"Oil\"), \"1\", \"0\")","v":"0"},{"$f":"IF(('Interactive Form'!C10<>\"Dirty\"), \"1\", \"0\")","v":"1"},1,{"$f":"IF('Interactive Form'!D10=D5, \"0\", \"1\")","v":"1"},{"$f":"(L3*M3*N3*O3*P3*Q3*R3*S3)","v":0},"","IP800P",""]
[null,null,null,"DI",null,"iMAG4700","SPT",null,null,null,"130F",{"$f":"IF(('Interactive Form'!B11<131), \"1\", \"0\")","v":"1"},{"$f":"IF(('Interactive Form'!B12<176), \"1\", \"0\")","v":"1"},{"$f":"IF((AND('Interactive Form'!B16>9, 'Interactive Form'!B17>4)), \"1\", \"0\")","v":"0"},{"$f":"IF((OR('Interactive Form'!B13=0.5, 'Interactive Form'!B13=0.75, 'Interactive Form'!B13=1, 'Interactive Form'!B13=1.5, 'Interactive Form'!B13=2, 'Interactive Form'!B13=3, 'Interactive Form'!B13=4, 'Interactive Form'!B13=6, 'Interactive Form'!B13=8)), \"1\", \"0\")","v":"0"},{"$f":"IF(OR('Interactive Form'!B10=\"Water\",'Interactive Form'!B10=\"Oil\"), \"1\", \"0\")","v":"0"},{"$f":"IF(('Interactive Form'!C10<>\"Dirty\"), \"1\", \"0\")","v":"1"},1,{"$f":"IF('Interactive Form'!D10=D5, \"0\", \"1\")","v":"1"},0,"","IP800Y",""]
[null,null,null,"Drinking    NSF",null,"EX800","IP800",null,null,null,"130F",{"$f":"IF(('Interactive Form'!B11<131), \"1\", \"0\")","v":"1"},{"$f":"IF(('Interactive Form'!B12<151), \"1\", \"0\")","v":"1"},{"$f":"IF((AND('Interactive Form'!B16>9, 'Interactive Form'!B17>4)), \"1\", \"0\")","v":"0"},{"$f":"IF((AND('Interactive Form'!B13>2.99, 'Interactive Form'!B13<12.1)), \"1\", \"0\")","v":"0"},{"$f":"IF(OR('Interactive Form'!B10=\"Water\",'Interactive Form'!B10=\"Oil\"), \"1\", \"0\")","v":"0"},{"$f":"IF(('Interactive Form'!C10<>\"Dirty\"), \"1\", \"0\")","v":"1"},1,{"$f":"IF('Interactive Form'!D10=D5, \"0\", \"1\")","v":"1"},0,"","IP110P",""]
[null,null,null,null,null,"EX100/200","IP100/200",null,null,null,"130F",{"$f":"IF(('Interactive Form'!B11<131), \"1\", \"0\")","v":"1"},{"$f":"IF(('Interactive Form'!B12<151), \"1\", \"0\")","v":"1"},{"$f":"IF((AND('Interactive Form'!B16>9, 'Interactive Form'!B17>4)), \"1\", \"0\")","v":"0"},{"$f":"IF((AND('Interactive Form'!B13>2.99, 'Interactive Form'!B13<12.1)), \"1\", \"0\")","v":"0"},{"$f":"IF(OR('Interactive Form'!B10=\"Water\",'Interactive Form'!B10=\"Oil\"), \"1\", \"0\")","v":"0"},{"$f":"IF(('Interactive Form'!C10<>\"Dirty\"), \"1\", \"0\")","v":"1"},1,{"$f":"IF('Interactive Form'!D10=D5, \"0\", \"1\")","v":"1"},0,"","IP150P",""]
[null,null,null,null,null,null,null,null,null,null,"130F",{"$f":"IF(('Interactive Form'!B11<131), \"1\", \"0\")","v":"1"},{"$f":"IF(('Interactive Form'!B12<151), \"1\", \"0\")","v":"1"},{"$f":"IF((AND('Interactive Form'!B16>9, 'Interactive Form'!B17>4)), \"1\", \"0\")","v":"0"},{"$f":"IF((AND('Interactive Form'!B13>11.9, 'Interactive Form'!B13<40.1)), \"1\", \"0\")","v":"0"},{"$f":"IF(OR('Interactive Form'!B10=\"Water\",'Interactive Form'!B10=\"Oil\"), \"1\", \"0\")","v":"0"},{"$f":"IF(('Interactive Form'!C10<>\"Dirty\"), \"1\", \"0\")","v":"1"},1,{"$f":"IF('Interactive Form'!D10=D5, \"0\", \"1\")","v":"1"},0,"","IP210P",""]
[null,null,null,null,null,null,null,null,null,null,"130F",{"$f":"IF(('Interactive Form'!B11<131), \"1\", \"0\")","v":"1"},{"$f":"IF(('Interactive Form'!B12<151), \"1\", \"0\")","v":"1"},{"$f":"IF((AND('Interactive Form'!B16>9, 'Interactive Form'!B17>4)), \"1\", \"0\")","v":"0"},{"$f":"IF((AND('Interactive Form'!B13>11.9, 'Interactive Form'!B13<40.1)), \"1\", \"0\")","v":"0"},{"$f":"IF(OR('Interactive Form'!B10=\"Water\",'Interactive Form'!B10=\"Oil\"), \"1\", \"0\")","v":"0"},{"$f":"IF(('Interactive Form'!C10<>\"Dirty\"), \"1\", \"0\")","v":"1"},1,{"$f":"IF('Interactive Form'!D10=D5, \"0\", \"1\")","v":"1"},0,"","IP250P",""]
[null,null,null,null,null,null,null,null,null,null,"130F",{"$f":"IF(('Interactive Form'!B11<131), \"1\", \"0\")","v":"1"},{"$f":"IF(('Interactive Form'!B12<151), \"1\", \"0\")","v":"1"},{"$f":"IF((AND('Interactive Form'!B16>1, 'Interactive Form'!B17>0)), \"1\", \"0\")","v":"0"},{"$f":"IF((OR('Interactive Form'!B13=1, 'Interactive Form'!B13=2, 'Interactive Form'!B13=2)), \"1\", \"0\")","v":"0"},{"$f":"IF(('Interactive Form'!B10<>\"Oil\"), \"1\", \"0\")","v":"1"},{"$f":"IF(OR('Interactive Form'!C10=\"Dirty\",'Interactive Form'!C10=\"Clean\"), \"1\", \"0\")","v":"0"},{"$f":"IF('Interactive Form'!D10<>\"DI\", \"1\", \"0\")","v":"1"},{"$f":"IF('Interactive Form'!D10=D5, \"0\", \"1\")","v":"1"},0,"","WMP",""]
[null,null,null,null,null,null,null,null,null,null,"140F",{"$f":"IF(('Interactive Form'!B11<141), \"1\", \"0\")","v":"1"},{"$f":"IF(('Interactive Form'!B12<151), \"1\", \"0\")","v":"1"},{"$f":"IF((AND('Interactive Form'!B16>1, 'Interactive Form'!B17>0)), \"1\", \"0\")","v":"0"},{"$f":"IF((OR('Interactive Form'!B13=2,'Interactive Form'!B13=3, 'Interactive Form'!B13=4, 'Interactive Form'!B13=6, 'Interactive Form'!B13=8, 'Interactive Form'!B13=10, 'Interactive Form'!B13=12)), \"1\", \"0\")","v":"0"},{"$f":"IF(('Interactive Form'!B10<>\"Oil\"), \"1\", \"0\")","v":"1"},{"$f":"IF(OR('Interactive Form'!C10=\"Dirty\",'Interactive Form'!C10=\"Clean\"), \"1\", \"0\")","v":"0"},{"$f":"IF('Interactive Form'!D10<>\"DI\", \"1\", \"0\")","v":"1"},1,0,"","iMAG4700",""]
[null,null,null,null,null,null,null,null,null,null,"140F",{"$f":"IF(('Interactive Form'!B11<141), \"1\", \"0\")","v":"1"},{"$f":"IF(('Interactive Form'!B12<151), \"1\", \"0\")","v":"1"},{"$f":"IF((AND('Interactive Form'!B16>1, 'Interactive Form'!B17>0)), \"1\", \"0\")","v":"0"},{"$f":"IF((OR('Interactive Form'!B13=2,'Interactive Form'!B13=3, 'Interactive Form'!B13=4, 'Interactive Form'!B13=6, 'Interactive Form'!B13=8, 'Interactive Form'!B13=10, 'Interactive Form'!B13=12)), \"1\", \"0\")","v":"0"},{"$f":"IF(('Interactive Form'!B10<>\"Oil\"), \"1\", \"0\")","v":"1"},{"$f":"IF(OR('Interactive Form'!C10=\"Dirty\",'Interactive Form'!C10=\"Clean\"), \"1\", \"0\")","v":"0"},{"$f":"IF('Interactive Form'!D10<>\"DI\", \"1\", \"0\")","v":"1"},1,0,{"$f":"IF(T11=1, \"x\", \"\")","v":""},"iMAG4700p",""]
[null,null,null,null,null,null,null,null,null,null,"140F",{"$f":"IF(('Interactive Form'!B11<141), \"1\", \"0\")","v":"1"},{"$f":"IF(('Interactive Form'!B12<151), \"1\", \"0\")","v":"1"},{"$f":"IF((AND('Interactive Form'!B16>1, 'Interactive Form'!B17>0)), \"1\", \"0\")","v":"0"},{"$f":"IF((OR('Interactive Form'!B13=2,'Interactive Form'!B13=3, 'Interactive Form'!B13=4, 'Interactive Form'!B13=6, 'Interactive Form'!B13=8, 'Interactive Form'!B13=10, 'Interactive Form'!B13=12)), \"1\", \"0\")","v":"0"},{"$f":"IF(('Interactive Form'!B10<>\"Oil\"), \"1\", \"0\")","v":"1"},{"$f":"IF(OR('Interactive Form'!C10=\"Dirty\",'Interactive Form'!C10=\"Clean\"), \"1\", \"0\")","v":"0"},{"$f":"IF('Interactive Form'!D10<>\"DI\", \"1\", \"0\")","v":"1"},1,0,{"$f":"IF(T12=1, \"x\", \"\")","v":""},"iMAG4700r",""]
[null,null,null,null,null,null,null,null,null,null,"160F",{"$f":"IF(('Interactive Form'!B11<161), \"1\", \"0\")","v":"1"},{"$f":"IF(('Interactive Form'!B12<151), \"1\", \"0\")","v":"1"},1,{"$f":"IF((OR('Interactive Form'!B13=0.375, 'Interactive Form'!B13=0.5, 'Interactive Form'!B13=0.75, 'Interactive Form'!B13=1)), \"1\", \"0\")","v":"0"},{"$f":"IF(OR('Interactive Form'!B10=\"Water\",'Interactive Form'!B10=\"Oil\"), \"1\", \"0\")","v":"0"},{"$f":"IF(('Interactive Form'!C10<>\"Dirty\"), \"1\", \"0\")","v":"1"},1,{"$f":"IF('Interactive Form'!D10=D5, \"0\", \"1\")","v":"1"},0,"","SPX",{"$f":"IF((AND(L13=\"X\", M13=\"X\", N13=\"X\")), \"Z\", \"\")","v":""}]
[null,null,null,null,null,null,null,null,null,null,"160F",{"$f":"IF(('Interactive Form'!B11<161), \"1\", \"0\")","v":"1"},{"$f":"IF(('Interactive Form'!B12<151), \"1\", \"0\")","v":"1"},1,{"$f":"IF((OR('Interactive Form'!B13=0.375, 'Interactive Form'!B13=0.5, 'Interactive Form'!B13=0.75, 'Interactive Form'!B13=1)), \"1\", \"0\")","v":"0"},{"$f":"IF(OR('Interactive Form'!B10=\"Water\",'Interactive Form'!B10=\"Oil\"), \"1\", \"0\")","v":"0"},{"$f":"IF(('Interactive Form'!C10<>\"Dirty\"), \"1\", \"0\")","v":"1"},1,{"$f":"IF('Interactive Form'!D10=D5, \"0\", \"1\")","v":"1"},0,"","SPT",{"$f":"IF((AND(L14=\"X\", M14=\"X\", N14=\"X\")), \"Z\", \"\")","v":""}]
["Fluid Type",null,null,null,null,null,null,null,null,null,"200F",{"$f":"IF(('Interactive Form'!B11<201), \"1\", \"0\")","v":"1"},{"$f":"IF(('Interactive Form'!B12<501), \"1\", \"0\")","v":"1"},1,{"$f":"IF((OR('Interactive Form'!B13=0.5, 'Interactive Form'!B13=0.75, 'Interactive Form'!B13=1)), \"1\", \"0\")","v":"0"},{"$f":"IF(OR('Interactive Form'!B10=\"Water\",'Interactive Form'!B10=\"Oil\"), \"1\", \"0\")","v":"0"},{"$f":"IF(('Interactive Form'!C10<>\"Dirty\"), \"1\", \"0\")","v":"1"},1,{"$f":"IF('Interactive Form'!D10=D5, \"0\", \"1\")","v":"1"},0,"","SES",""]
[null,null,null,null,null,null,null,null,null,null,"200F",{"$f":"IF(('Interactive Form'!B11<201), \"1\", \"0\")","v":"1"},{"$f":"IF(('Interactive Form'!B12<151), \"1\", \"0\")","v":"1"},1,{"$f":"IF((OR('Interactive Form'!B13=0.25, 'Interactive Form'!B13=0.375, 'Interactive Form'!B13=0.5, 'Interactive Form'!B13=0.75)), \"1\", \"0\")","v":"0"},{"$f":"IF(('Interactive Form'!B10<>\"Oil\"), \"1\", \"0\")","v":"1"},{"$f":"IF(OR('Interactive Form'!C10=\"Dirty\",'Interactive Form'!C10=\"Clean\"), \"1\", \"0\")","v":"0"},{"$f":"IF('Interactive Form'!D10<>\"DI\", \"1\", \"0\")","v":"1"},{"$f":"IF('Interactive Form'!D10=D5, \"0\", \"1\")","v":"1"},0,"","PE202",""]
["Temperature",null,null,null,null,null,null,null,null,null,"200F",{"$f":"IF(('Interactive Form'!B11<201), \"1\", \"0\")","v":"1"},{"$f":"IF(('Interactive Form'!B12<201), \"1\", \"0\")","v":"1"},{"$f":"IF((AND('Interactive Form'!B16>9, 'Interactive Form'!B17>4)), \"1\", \"0\")","v":"0"},{"$f":"IF((AND('Interactive Form'!B13>0.99, 'Interactive Form'!B13<12.1)), \"1\", \"0\")","v":"0"},{"$f":"IF(('Interactive Form'!B10<>\"Oil\"), \"1\", \"0\")","v":"1"},{"$f":"IF(OR('Interactive Form'!C10=\"Dirty\",'Interactive Form'!C10=\"Clean\"), \"1\", \"0\")","v":"0"},{"$f":"IF('Interactive Form'!D10<>\"DI\", \"1\", \"0\")","v":"1"},{"$f":"IF('Interactive Form'!D10=D5, \"0\", \"1\")","v":"1"},0,"","EX800B",""]
["Pressure",null,null,null,null,null,null,null,null,null,"200F",{"$f":"IF(('Interactive Form'!B11<201), \"1\", \"0\")","v":"1"},{"$f":"IF(('Interactive Form'!B12<201), \"1\", \"0\")","v":"1"},{"$f":"IF((AND('Interactive Form'!B16>9, 'Interactive Form'!B17>4)), \"1\", \"0\")","v":"0"},{"$f":"IF((AND('Interactive Form'!B13>0.99, 'Interactive Form'!B13<12.1)), \"1\", \"0\")","v":"0"},{"$f":"IF(('Interactive Form'!B10<>\"Oil\"), \"1\", \"0\")","v":"1"},{"$f":"IF(OR('Interactive Form'!C10=\"Dirty\",'Interactive Form'!C10=\"Clean\"), \"1\", \"0\")","v":"0"},{"$f":"IF('Interactive Form'!D10<>\"DI\", \"1\", \"0\")","v":"1"},1,0,"","EX800S",""]
["Line Size",null,null,null,null,null,null,null,null,null,"200F",{"$f":"IF(('Interactive Form'!B11<201), \"1\", \"0\")","v":"1"},{"$f":"IF(('Interactive Form'!B12<201), \"1\", \"0\")","v":"1"},{"$f":"IF((AND('Interactive Form'!B16>9, 'Interactive Form'!B17>4)), \"1\", \"0\")","v":"0"},{"$f":"IF((OR('Interactive Form'!B13=0.5, 'Interactive Form'!B13=0.75, 'Interactive Form'!B13=1, 'Interactive Form'!B13=1.5, 'Interactive Form'!B13=2, 'Interactive Form'!B13=3, 'Interactive Form'!B13=4, 'Interactive Form'!B13=6, 'Interactive Form'!B13=8)), \"1\", \"0\")","v":"0"},{"$f":"IF(OR('Interactive Form'!B10=\"Water\",'Interactive Form'!B10=\"Oil\"), \"1\", \"0\")","v":"0"},{"$f":"IF(('Interactive Form'!C10<>\"Dirty\"), \"1\", \"0\")","v":"1"},1,{"$f":"IF('Interactive Form'!D10=D5, \"0\", \"1\")","v":"1"},0,"","IP800B",""]
["Pipe Material",null,null,null,null,null,null,null,null,null,"200F",{"$f":"IF(('Interactive Form'!B11<201), \"1\", \"0\")","v":"1"},{"$f":"IF(('Interactive Form'!B12<401), \"1\", \"0\")","v":"1"},{"$f":"IF((AND('Interactive Form'!B16>9, 'Interactive Form'!B17>4)), \"1\", \"0\")","v":"0"},{"$f":"IF((OR('Interactive Form'!B13=0.5, 'Interactive Form'!B13=0.75, 'Interactive Form'!B13=1, 'Interactive Form'!B13=1.5, 'Interactive Form'!B13=2, 'Interactive Form'!B13=3, 'Interactive Form'!B13=4, 'Interactive Form'!B13=6, 'Interactive Form'!B13=8)), \"1\", \"0\")","v":"0"},{"$f":"IF(OR('Interactive Form'!B10=\"Water\",'Interactive Form'!B10=\"Oil\"), \"1\", \"0\")","v":"0"},{"$f":"IF(('Interactive Form'!C10<>\"Dirty\"), \"1\", \"0\")","v":"1"},1,{"$f":"IF('Interactive Form'!D10=D5, \"0\", \"1\")","v":"1"},0,"","IP800S-HP",""]
[null,null,null,null,null,null,null,null,null,null,"200F",{"$f":"IF(('Interactive Form'!B12<201), \"1\", \"0\")","v":"1"},{"$f":"IF(('Interactive Form'!B13<201), \"1\", \"0\")","v":"1"},{"$f":"IF((AND('Interactive Form'!B17>9, 'Interactive Form'!B18>4)), \"1\", \"0\")","v":"0"},{"$f":"IF((OR('Interactive Form'!B14=0.5, 'Interactive Form'!B14=0.75, 'Interactive Form'!B14=1, 'Interactive Form'!B14=1.5, 'Interactive Form'!B14=2, 'Interactive Form'!B14=3, 'Interactive Form'!B14=4, 'Interactive Form'!B14=6, 'Interactive Form'!B14=8)), \"1\", \"0\")","v":"0"},{"$f":"IF(OR('Interactive Form'!B11=\"Water\",'Interactive Form'!B11=\"Oil\"), \"1\", \"0\")","v":"0"},{"$f":"IF(('Interactive Form'!C11<>\"Dirty\"), \"1\", \"0\")","v":"1"},1,{"$f":"IF('Interactive Form'!D10=D5, \"0\", \"1\")","v":"1"},0,{"$f":"IF(T21=1, \"x\", \"\")","v":""},"IP800S",{"$f":"IF((AND(L22=\"X\", M22=\"X\", N22=\"X\")), \"Z\", \"\")","v":""}]
["Straight Run Pipe Diameters",null,null,null,null,null,null,null,null,null,"200F",{"$f":"IF(('Interactive Form'!B11<201), \"1\", \"0\")","v":"1"},{"$f":"IF(('Interactive Form'!B12<201), \"1\", \"0\")","v":"1"},{"$f":"IF((AND('Interactive Form'!B16>9, 'Interactive Form'!B17>4)), \"1\", \"0\")","v":"0"},{"$f":"IF((AND('Interactive Form'!B13>2.99, 'Interactive Form'!B13<10.1)), \"1\", \"0\")","v":"0"},{"$f":"IF(('Interactive Form'!B10<>\"Oil\"), \"1\", \"0\")","v":"1"},{"$f":"IF(OR('Interactive Form'!C10=\"Dirty\",'Interactive Form'!C10=\"Clean\"), \"1\", \"0\")","v":"0"},{"$f":"IF('Interactive Form'!D10<>\"DI\", \"1\", \"0\")","v":"1"},{"$f":"IF('Interactive Form'!D10=D5, \"0\", \"1\")","v":"1"},0,"","EX110B",""]
[null,null,null,null,null,null,null,null,null,null,"200F",{"$f":"IF(('Interactive Form'!B11<201), \"1\", \"0\")","v":"1"},{"$f":"IF(('Interactive Form'!B12<201), \"1\", \"0\")","v":"1"},{"$f":"IF((AND('Interactive Form'!B16>9, 'Interactive Form'!B17>4)), \"1\", \"0\")","v":"0"},{"$f":"IF((AND('Interactive Form'!B13>2.99, 'Interactive Form'!B13<10.1)), \"1\", \"0\")","v":"0"},{"$f":"IF(('Interactive Form'!B10<>\"Oil\"), \"1\", \"0\")","v":"1"},{"$f":"IF(OR('Interactive Form'!C10=\"Dirty\",'Interactive Form'!C10=\"Clean\"), \"1\", \"0\")","v":"0"},{"$f":"IF('Interactive Form'!D10<>\"DI\", \"1\", \"0\")","v":"1"},{"$f":"IF('Interactive Form'!D10=D5, \"0\", \"1\")","v":"1"},0,"","EX150B",""]
["Is this a replacement meter?",null,null,null,null,null,null,null,null,null,"200F",{"$f":"IF(('Interactive Form'!B11<201), \"1\", \"0\")","v":"1"},{"$f":"IF(('Interactive Form'!B12<201), \"1\", \"0\")","v":"1"},{"$f":"IF((AND('Interactive Form'!B16>9, 'Interactive Form'!B17>4)), \"1\", \"0\")","v":"0"},{"$f":"IF((AND('Interactive Form'!B13>10.9, 'Interactive Form'!B13<48.1)), \"1\", \"0\")","v":"0"},{"$f":"IF(('Interactive Form'!B10<>\"Oil\"), \"1\", \"0\")","v":"1"},{"$f":"IF(OR('Interactive Form'!C10=\"Dirty\",'Interactive Form'!C10=\"Clean\"), \"1\", \"0\")","v":"0"},{"$f":"IF('Interactive Form'!D10<>\"DI\", \"1\", \"0\")","v":"1"},{"$f":"IF('Interactive Form'!D10=D5, \"0\", \"1\")","v":"1"},0,"","EX210B",""]
["Measurement Purpose",null,null,null,null,null,null,null,null,null,"200F",{"$f":"IF(('Interactive Form'!B11<201), \"1\", \"0\")","v":"1"},{"$f":"IF(('Interactive Form'!B12<201), \"1\", \"0\")","v":"1"},{"$f":"IF((AND('Interactive Form'!B16>9, 'Interactive Form'!B17>4)), \"1\", \"0\")","v":"0"},{"$f":"IF((AND('Interactive Form'!B13>10.9, 'Interactive Form'!B13<48.1)), \"1\", \"0\")","v":"0"},{"$f":"IF(('Interactive Form'!B10<>\"Oil\"), \"1\", \"0\")","v":"1"},{"$f":"IF(OR('Interactive Form'!C10=\"Dirty\",'Interactive Form'!C10=\"Clean\"), \"1\", \"0\")","v":"0"},{"$f":"IF('Interactive Form'!D10<>\"DI\", \"1\", \"0\")","v":"1"},{"$f":"IF('Interactive Form'!D10=D5, \"0\", \"1\")","v":"1"},0,"","EX250B",""]
["Power Available",null,null,null,null,null,null,null,null,null,"200F",{"$f":"IF(('Interactive Form'!B11<201), \"1\", \"0\")","v":"1"},{"$f":"IF(('Interactive Form'!B12<201), \"1\", \"0\")","v":"1"},{"$f":"IF((AND('Interactive Form'!B16>9, 'Interactive Form'!B17>4)), \"1\", \"0\")","v":"0"},{"$f":"IF((AND('Interactive Form'!B13>2.99, 'Interactive Form'!B13<10.1)), \"1\", \"0\")","v":"0"},{"$f":"IF(('Interactive Form'!B10<>\"Oil\"), \"1\", \"0\")","v":"1"},{"$f":"IF(OR('Interactive Form'!C10=\"Dirty\",'Interactive Form'!C10=\"Clean\"), \"1\", \"0\")","v":"0"},{"$f":"IF('Interactive Form'!D10<>\"DI\", \"1\", \"0\")","v":"1"},1,0,"","EX110S",""]
[null,null,null,null,null,null,null,null,null,null,"200F",{"$f":"IF(('Interactive Form'!B11<201), \"1\", \"0\")","v":"1"},{"$f":"IF(('Interactive Form'!B12<201), \"1\", \"0\")","v":"1"},{"$f":"IF((AND('Interactive Form'!B16>9, 'Interactive Form'!B17>4)), \"1\", \"0\")","v":"0"},{"$f":"IF((AND('Interactive Form'!B13>2.99, 'Interactive Form'!B13<10.1)), \"1\", \"0\")","v":"0"},{"$f":"IF(('Interactive Form'!B10<>\"Oil\"), \"1\", \"0\")","v":"1"},{"$f":"IF(OR('Interactive Form'!C10=\"Dirty\",'Interactive Form'!C10=\"Clean\"), \"1\", \"0\")","v":"0"},{"$f":"IF('Interactive Form'!D10<>\"DI\", \"1\", \"0\")","v":"1"},1,0,"","EX150S",""]
[null,null,null,null,null,null,null,null,null,null,"200F",{"$f":"IF(('Interactive Form'!B11<201), \"1\", \"0\")","v":"1"},{"$f":"IF(('Interactive Form'!B12<201), \"1\", \"0\")","v":"1"},{"$f":"IF((AND('Interactive Form'!B16>9, 'Interactive Form'!B17>4)), \"1\", \"0\")","v":"0"},{"$f":"IF((AND('Interactive Form'!B13>10.9, 'Interactive Form'!B13<48.1)), \"1\", \"0\")","v":"0"},{"$f":"IF(('Interactive Form'!B10<>\"Oil\"), \"1\", \"0\")","v":"1"},{"$f":"IF(OR('Interactive Form'!C10=\"Dirty\",'Interactive Form'!C10=\"Clean\"), \"1\", \"0\")","v":"0"},{"$f":"IF('Interactive Form'!D10<>\"DI\", \"1\", \"0\")","v":"1"},1,0,"","EX210S",""]
["Telemetry",null,null,null,null,null,null,null,null,null,"200F",{"$f":"IF(('Interactive Form'!B11<201), \"1\", \"0\")","v":"1"},{"$f":"IF(('Interactive Form'!B12<201), \"1\", \"0\")","v":"1"},{"$f":"IF((AND('Interactive Form'!B16>9, 'Interactive Form'!B17>4)), \"1\", \"0\")","v":"0"},{"$f":"IF((AND('Interactive Form'!B13>10.9, 'Interactive Form'!B13<48.1)), \"1\", \"0\")","v":"0"},{"$f":"IF(('Interactive Form'!B10<>\"Oil\"), \"1\", \"0\")","v":"1"},{"$f":"IF(OR('Interactive Form'!C10=\"Dirty\",'Interactive Form'!C10=\"Clean\"), \"1\", \"0\")","v":"0"},{"$f":"IF('Interactive Form'!D10<>\"DI\", \"1\", \"0\")","v":"1"},1,0,"","EX250S",""]
["Outputs",null,null,null,null,null,null,null,null,null,"200F",{"$f":"IF(('Interactive Form'!B11<201), \"1\", \"0\")","v":"1"},{"$f":"IF(('Interactive Form'!B12<201), \"1\", \"0\")","v":"1"},{"$f":"IF((AND('Interactive Form'!B16>9, 'Interactive Form'!B17>4)), \"1\", \"0\")","v":"0"},{"$f":"IF((AND('Interactive Form'!B13>2.99, 'Interactive Form'!B13<12.1)), \"1\", \"0\")","v":"0"},{"$f":"IF(OR('Interactive Form'!B10=\"Water\",'Interactive Form'!B10=\"Oil\"), \"1\", \"0\")","v":"0"},{"$f":"IF(('Interactive Form'!C10<>\"Dirty\"), \"1\", \"0\")","v":"1"},1,{"$f":"IF('Interactive Form'!D10=D5, \"0\", \"1\")","v":"1"},0,"","IP110B",""]
["Display?",null,null,null,null,null,null,null,null,null,"200F",{"$f":"IF(('Interactive Form'!B11<201), \"1\", \"0\")","v":"1"},{"$f":"IF(('Interactive Form'!B12<201), \"1\", \"0\")","v":"1"},{"$f":"IF((AND('Interactive Form'!B16>9, 'Interactive Form'!B17>4)), \"1\", \"0\")","v":"0"},{"$f":"IF((AND('Interactive Form'!B13>2.99, 'Interactive Form'!B13<12.1)), \"1\", \"0\")","v":"0"},{"$f":"IF(OR('Interactive Form'!B10=\"Water\",'Interactive Form'!B10=\"Oil\"), \"1\", \"0\")","v":"0"},{"$f":"IF(('Interactive Form'!C10<>\"Dirty\"), \"1\", \"0\")","v":"1"},1,{"$f":"IF('Interactive Form'!D10=D5, \"0\", \"1\")","v":"1"},0,"","IP150B",""]
["Will meter potentially be flooded?",null,null,null,null,null,null,null,null,null,"200F",{"$f":"IF(('Interactive Form'!B11<201), \"1\", \"0\")","v":"1"},{"$f":"IF(('Interactive Form'!B12<201), \"1\", \"0\")","v":"1"},{"$f":"IF((AND('Interactive Form'!B16>9, 'Interactive Form'!B17>4)), \"1\", \"0\")","v":"0"},{"$f":"IF((AND('Interactive Form'!B13>11.9, 'Interactive Form'!B13<40.1)), \"1\", \"0\")","v":"0"},{"$f":"IF(OR('Interactive Form'!B10=\"Water\",'Interactive Form'!B10=\"Oil\"), \"1\", \"0\")","v":"0"},{"$f":"IF(('Interactive Form'!C10<>\"Dirty\"), \"1\", \"0\")","v":"1"},1,{"$f":"IF('Interactive Form'!D10=D5, \"0\", \"1\")","v":"1"},0,"","IP210B",""]
["Can the meter be flanged?",null,null,null,null,null,null,null,null,null,"200F",{"$f":"IF(('Interactive Form'!B11<201), \"1\", \"0\")","v":"1"},{"$f":"IF(('Interactive Form'!B12<201), \"1\", \"0\")","v":"1"},{"$f":"IF((AND('Interactive Form'!B16>9, 'Interactive Form'!B17>4)), \"1\", \"0\")","v":"0"},{"$f":"IF((AND('Interactive Form'!B13>11.9, 'Interactive Form'!B13<40.1)), \"1\", \"0\")","v":"0"},{"$f":"IF(OR('Interactive Form'!B10=\"Water\",'Interactive Form'!B10=\"Oil\"), \"1\", \"0\")","v":"0"},{"$f":"IF(('Interactive Form'!C10<>\"Dirty\"), \"1\", \"0\")","v":"1"},1,{"$f":"IF('Interactive Form'!D10=D5, \"0\", \"1\")","v":"1"},0,"","IP250B",""]
[null,null,null,null,null,null,null,null,null,null,"200F",{"$f":"IF(('Interactive Form'!B11<201), \"1\", \"0\")","v":"1"},{"$f":"IF(('Interactive Form'!B12<201), \"1\", \"0\")","v":"1"},{"$f":"IF((AND('Interactive Form'!B16>9, 'Interactive Form'!B17>4)), \"1\", \"0\")","v":"0"},{"$f":"IF((AND('Interactive Form'!B13>2.99, 'Interactive Form'!B13<12.1)), \"1\", \"0\")","v":"0"},{"$f":"IF(OR('Interactive Form'!B10=\"Water\",'Interactive Form'!B10=\"Oil\"), \"1\", \"0\")","v":"0"},{"$f":"IF(('Interactive Form'!C10<>\"Dirty\"), \"1\", \"0\")","v":"1"},1,{"$f":"IF('Interactive Form'!D10=D5, \"0\", \"1\")","v":"1"},0,"","IP110S",""]
["Will customer accept pin in place meter?",null,null,null,null,null,null,null,null,null,"200F",{"$f":"IF(('Interactive Form'!B11<201), \"1\", \"0\")","v":"1"},{"$f":"IF(('Interactive Form'!B12<201), \"1\", \"0\")","v":"1"},{"$f":"IF((AND('Interactive Form'!B16>9, 'Interactive Form'!B17>4)), \"1\", \"0\")","v":"0"},{"$f":"IF((AND('Interactive Form'!B13>2.99, 'Interactive Form'!B13<12.1)), \"1\", \"0\")","v":"0"},{"$f":"IF(OR('Interactive Form'!B10=\"Water\",'Interactive Form'!B10=\"Oil\"), \"1\", \"0\")","v":"0"},{"$f":"IF(('Interactive Form'!C10<>\"Dirty\"), \"1\", \"0\")","v":"1"},1,{"$f":"IF('Interactive Form'!D10=D5, \"0\", \"1\")","v":"1"},0,"","IP150S",""]
["Accessible once installed?",null,null,null,null,null,null,null,null,null,"200F",{"$f":"IF(('Interactive Form'!B11<201), \"1\", \"0\")","v":"1"},{"$f":"IF(('Interactive Form'!B12<201), \"1\", \"0\")","v":"1"},{"$f":"IF((AND('Interactive Form'!B16>9, 'Interactive Form'!B17>4)), \"1\", \"0\")","v":"0"},{"$f":"IF((AND('Interactive Form'!B13>11.9, 'Interactive Form'!B13<40.1)), \"1\", \"0\")","v":"0"},{"$f":"IF(OR('Interactive Form'!B10=\"Water\",'Interactive Form'!B10=\"Oil\"), \"1\", \"0\")","v":"0"},{"$f":"IF(('Interactive Form'!C10<>\"Dirty\"), \"1\", \"0\")","v":"1"},1,{"$f":"IF('Interactive Form'!D10=D5, \"0\", \"1\")","v":"1"},0,"","IP210S",""]
[null,null,null,null,null,null,null,null,null,null,"200F",{"$f":"IF(('Interactive Form'!B11<201), \"1\", \"0\")","v":"1"},{"$f":"IF(('Interactive Form'!B12<201), \"1\", \"0\")","v":"1"},{"$f":"IF((AND('Interactive Form'!B16>9, 'Interactive Form'!B17>4)), \"1\", \"0\")","v":"0"},{"$f":"IF((AND('Interactive Form'!B13>11.9, 'Interactive Form'!B13<40.1)), \"1\", \"0\")","v":"0"},{"$f":"IF(OR('Interactive Form'!B10=\"Water\",'Interactive Form'!B10=\"Oil\"), \"1\", \"0\")","v":"0"},{"$f":"IF(('Interactive Form'!C10<>\"Dirty\"), \"1\", \"0\")","v":"1"},1,{"$f":"IF('Interactive Form'!D10=D5, \"0\", \"1\")","v":"1"},0,"","IP250S",""]
[null,null,null,null,null,null,null,null,null,null,"200F",{"$f":"IF(('Interactive Form'!B11<201), \"1\", \"0\")","v":"1"},{"$f":"IF(('Interactive Form'!B12<201), \"1\", \"0\")","v":"1"},{"$f":"IF((AND('Interactive Form'!B16>4, 'Interactive Form'!B17>1)), \"1\", \"0\")","v":"0"},{"$f":"IF((OR('Interactive Form'!B13=4, 'Interactive Form'!B13=6, 'Interactive Form'!B13=8, 'Interactive Form'!B13=10, 'Interactive Form'!B13=12)), \"1\", \"0\")","v":"0"},{"$f":"IF(('Interactive Form'!B10<>\"Oil\"), \"1\", \"0\")","v":"1"},{"$f":"IF(OR('Interactive Form'!C10=\"Dirty\",'Interactive Form'!C10=\"Clean\"), \"1\", \"0\")","v":"0"},{"$f":"IF('Interactive Form'!D10<>\"DI\", \"1\", \"0\")","v":"1"},1,0,"","EX90"]
[null,null,null,null,null,null,null,null,null,null,"120F",{"$f":"IF(('Interactive Form'!B11<121), \"1\", \"0\")","v":"1"},{"$f":"IF(('Interactive Form'!B12<151), \"1\", \"0\")","v":"1"},{"$f":"IF((AND('Interactive Form'!B16>9, 'Interactive Form'!B17>4)), \"1\", \"0\")","v":"0"},{"$f":"IF((OR('Interactive Form'!B13=3, 'Interactive Form'!B13=4, 'Interactive Form'!B13=6)), \"1\", \"0\")","v":"0"},{"$f":"IF(OR('Interactive Form'!B10=\"Water\",'Interactive Form'!B10=\"Oil\"), \"1\", \"0\")","v":"0"},{"$f":"IF(('Interactive Form'!C10<>\"Dirty\"), \"1\", \"0\")","v":"1"},1,{"$f":"IF('Interactive Form'!D10=D5, \"0\", \"1\")","v":"1"},0,"","WTP"]
[null,null,null,null,null,null,null,null,null,null,"200F",{"$f":"IF(('Interactive Form'!B11<201), \"1\", \"0\")","v":"1"},{"$f":"IF(('Interactive Form'!B12<201), \"1\", \"0\")","v":"1"},{"$f":"IF((AND('Interactive Form'!B16>9, 'Interactive Form'!B17>4)), \"1\", \"0\")","v":"0"},{"$f":"IF((OR('Interactive Form'!B13=3, 'Interactive Form'!B13=4, 'Interactive Form'!B13=6, 'Interactive Form'!B13=8)), \"1\", \"0\")","v":"0"},{"$f":"IF(OR('Interactive Form'!B10=\"Water\",'Interactive Form'!B10=\"Oil\"), \"1\", \"0\")","v":"0"},{"$f":"IF(('Interactive Form'!C10<>\"Dirty\"), \"1\", \"0\")","v":"1"},1,{"$f":"IF('Interactive Form'!D10=D5, \"0\", \"1\")","v":"1"},0,"","WTS"]
[]
[]
[]
[]
[]
[]
[]
[]
[]
[]
[null,null,null,null,null,null,null,null,null,null,{"$f":"_xlfn.TEXTJOIN(\", \",TRUE,IF(U2:U50=\"x\",V2:V50,\"\"))","v":""}]

{"sheet":"EX800","index":5,"n_rows":177,"n_cols":8,"rows_kept":177,"cut":false,"hidden":false,"merged":[[172,0,172,1],[172,2,172,5],[173,0,173,1],[173,2,173,5],[174,0,174,1],[174,2,174,5],[175,0,175,1],[175,2,175,5],[176,0,176,1],[176,2,176,5],[167,0,167,1],[167,2,167,5],[168,0,168,1],[168,2,168,5],[169,0,169,1],[169,2,169,5],[170,0,170,1],[170,2,170,5],[171,0,171,1],[171,2,171,5],[162,0,162,1],[162,2,162,5],[163,0,163,1],[163,2,163,5],[164,0,164,1],[164,2,164,5],[165,0,165,1],[165,2,165,5],[166,0,166,1],[166,2,166,5],[156,0,156,1],[156,2,156,5],[157,0,157,1],[157,2,157,5],[158,0,158,1],[158,2,158,5],[160,0,160,6],[161,0,161,1],[161,2,161,5],[151,0,151,1],[151,2,151,5],[152,0,152,1],[152,2,152,5],[153,0,153,1],[153,2,153,5],[154,0,154,1],[154,2,154,5],[155,0,155,1],[155,2,155,5],[146,0,146,6],[147,0,147,1],[147,2,147,5],[148,0,148,1],[148,2,148,5],[149,0,149,1],[149,2,149,5],[150,0,150,1],[150,2,150,5],[104,2,104,5],[126,0,126,6],[127,0,127,1],[127,2,127,5],[50,0,50,6],[82,0,82,6],[103,0,103,6],[83,0,83,1],[83,2,83,5],[123,0,123,1],[123,2,123,5],[124,0,124,1],[124,2,124,5],[125,0,125,1],[125,2,125,5],[120,0,120,1],[120,2,120,5],[121,0,121,1],[121,2,121,5],[122,0,122,1],[122,2,122,5],[117,0,117,1],[117,2,117,5],[118,0,118,1],[118,2,118,5],[119,0,119,1],[119,2,119,5],[114,2,114,5],[115,0,115,1],[115,2,115,5],[116,0,116,1],[116,2,116,5],[112,0,112,1],[110,0,110,1],[111,0,111,1],[113,0,113,1],[114,0,114,1],[107,0,107,1],[108,0,108,1],[109,0,109,1],[100,0,100,1],[101,0,101,1],[102,0,102,1],[105,0,105,1],[106,0,106,1],[104,0,104,1],[96,0,96,1],[96,2,96,5],[97,0,97,1],[98,0,98,1],[99,0,99,1],[92,0,92,1],[93,0,93,1],[94,0,94,1],[95,0,95,1],[95,2,95,5],[87,0,87,1],[88,0,88,1],[89,0,89,1],[90,0,90,1],[91,0,91,1],[84,0,84,1],[84,2,84,5],[85,0,85,1],[85,2,85,5],[86,0,86,1],[77,0,77,1],[78,0,78,1],[79,0,79,1],[80,0,80,1],[81,0,81,1],[72,0,72,1],[73,0,73,1],[74,0,74,1],[75,0,75,1],[76,0,76,1],[68,0,68,1],[68,2,68,5],[69,0,69,1],[70,0,70,1],[71,0,71,1],[65,0,65,1],[65,2,65,5],[66,0,66,1],[66,2,66,5],[67,0,67,1],[67,2,67,5],[52,0,52,1],[51,0,51,1],[63,0,63,1],[63,2,63,5],[64,0,64,1],[64,2,64,5],[58,0,58,1],[59,0,59,1],[60,0,60,1],[61,0,61,1],[62,0,62,1],[53,0,53,1],[54,0,54,1],[55,0,55,1],[56,0,56,1],[57,0,57,1],[51,2,51,5],[52,2,52,5],[56,2,56,5],[57,2,57,5],[58,2,58,5],[53,2,53,5],[54,2,54,5],[55,2,55,5],[46,4,46,6],[0,2,0,4],[0,5,0,6],[2,3,2,5],[20,4,20,6],[21,4,21,6],[22,4,22,6],[15,4,15,6],[23,4,23,6],[24,4,24,6],[25,4,25,6],[26,4,26,6],[27,4,27,6],[28,4,28,6],[62,2,62,5],[59,2,59,5],[60,2,60,5],[61,2,61,5],[72,2,72,5],[73,2,73,5],[74,2,74,5],[69,2,69,5],[70,2,70,5],[71,2,71,5],[78,2,78,5],[79,2,79,5],[80,2,80,5],[75,2,75,5],[76,2,76,5],[77,2,77,5],[88,2,88,5],[89,2,89,5],[90,2,90,5],[81,2,81,5],[86,2,86,5],[87,2,87,5],[101,2,101,5],[94,2,94,5],[97,2,97,5],[98,2,98,5],[91,2,91,5],[92,2,92,5],[93,2,93,5],[113,2,113,5],[13,4,13,6],[14,4,14,6],[16,4,16,6],[17,4,17,6],[110,2,110,5],[111,2,111,5],[112,2,112,5],[107,2,107,5],[108,2,108,5],[109,2,109,5],[102,2,102,5],[105,2,105,5],[106,2,106,5],[99,2,99,5],[100,2,100,5],[35,4,35,6],[40,1,47,1],[39,0,47,0],[14,1,18,1],[47,4,47,6],[18,4,18,6],[36,4,36,6],[43,4,43,6],[37,4,37,6],[39,4,39,6],[40,4,40,6],[41,4,41,6],[30,4,30,6],[31,4,31,6],[32,4,32,6],[33,4,33,6],[34,4,34,6],[14,0,18,0],[21,0,28,0],[21,1,28,1],[31,1,37,1],[31,0,37,0],[42,4,42,6],[44,4,44,6],[45,4,45,6]]}
[null,{"$f":"_xlfn.TEXTJOIN(\"\",TRUE,C13,D13)","v":"Please SelectPlease Select"},{"$f":"E13","v":""},null,null,{"$f":"_xlfn.TEXTJOIN(\"-\",TRUE,B1,C1)","v":"Please SelectPlease Select"}]
[null,"Meter","Options"]
["Costs",{"$f":"_xlfn.IFS(B1=\"EX810B\",'Cost Data'!D332, B1=\"EX810P\",'Cost Data'!D333, B1=\"EX810S\",'Cost Data'!D334, B1=\"EX820B\",'Cost Data'!D335, B1=\"EX820P\",'Cost Data'!D336, B1=\"EX820S\",'Cost Data'!D337, B1=\"EX830B\",'Cost Data'!D338, B1=\"EX830P\",'Cost Data'!D339, B1=\"EX830S\",'Cost Data'!D340, B1=\"EX813B\",'Cost Data'!D341, B1=\"EX813P\",'Cost Data'!D342, B1=\"EX813S\",'Cost Data'!D343, B1=\"EX823B\",'Cost Data'!D344, B1=\"EX823P\",'Cost Data'!D345, B1=\"EX823S\",'Cost Data'!D346, B1=\"EX833B\",'Cost Data'!D347, B1=\"EX833P\",'Cost Data'!D348, B1=\"EX833S\",'Cost Data'!D349, B1=\"EX816B\",'Cost Data'!D350, B1=\"EX816P\",'Cost Data'!D351, B1=\"EX816S\",'Cost Data'!D352, B1=\"EX826B\",'Cost Data'!D353, B1=\"EX826P\",'Cost Data'!D354, B1=\"EX826S\",'Cost Data'!D355, B1=\"EX836B\",'Cost Data'!D356, B1=\"EX836P\",'Cost Data'!D357, B1=\"EX836S\",'Cost Data'!D358, B1=\"EX819B\",'Cost Data'!D359, B1=\"EX819P\",'Cost Data'!D360, B1=\"EX819S\",'Cost Data'!D361, B1=\"EX829B\",'Cost Data'!D362, B1=\"EX829P\",'Cost Data'!D363, B1=\"EX829S\",'Cost Data'!D364, B1=\"EX839B\",'Cost Data'!D365, B1=\"EX839P\",'Cost Data'!D366, B1=\"EX839S\",'Cost Data'!D367)","v":{"$error":"#N/A"}},{"$f":"SUM(C5:C12)","v":0},"Total",null,null,{"$f":"B3+C3","v":{"$error":"#N/A"}}]
[null,null,null,null,null,"Available Options","All Options"]
[null,null,{"$f":"_xlfn.IFS(E5=\"\",0,E5=$G$5,'Cost Data'!$D$368,E5=$G$6,'Cost Data'!$D$369,E5=$G$7,'Cost Data'!$D$370,E5=$G$8,'Cost Data'!$D$371,E5=$G$9,'Cost Data'!$D$372,E5=$G$10,'Cost Data'!$D$373,E5=$G$11,'Cost Data'!$D$374,E5=$G$12,'Cost Data'!$D$375)","v":0},"Option 1",null,{"$f":"_xlfn.IFS(C13<>\"Please Select\",\"Reverse Flow Output = -15\",C13=\"Please Select\",\"\")","v":""},"Reverse Flow Output = -15",{"$f":"_xlfn.IFS(E5=\"\",\"\",E5=$G$5,15,E5=$G$6,32,E5=$G$7,40,E5=$G$8,50,E5=$G$9,64,E5=$G$10,98,E5=$G$11,125,E5=$G$12,126)","v":""}]
[null,null,{"$f":"_xlfn.IFS(E6=\"\",0,E6=$G$5,'Cost Data'!$D$368,E6=$G$6,'Cost Data'!$D$369,E6=$G$7,'Cost Data'!$D$370,E6=$G$8,'Cost Data'!$D$371,E6=$G$9,'Cost Data'!$D$372,E6=$G$10,'Cost Data'!$D$373,E6=$G$11,'Cost Data'!$D$374,E6=$G$12,'Cost Data'!$D$375)","v":0},"Option 2",null,{"$f":"_xlfn.IFS(C13=\"EX810\",E16, C13=\"EX820\",E16, C13=\"EX830\",E16, C13=\"EX813\",E23, C13=\"EX823\",E23, C13=\"EX833\",E23, C13=\"EX816\",E33, C13=\"EX826\",E33, C13=\"EX836\",E33, C13=\"EX819\",E42, C13=\"EX829\",E42, C13=\"EX839\",E42,C13=\"Please Select\",\"\")","v":""},"Tamper Evident Kit = -32",{"$f":"_xlfn.IFS(E6=\"\",\"\",E6=$G$5,15,E6=$G$6,32,E6=$G$7,40,E6=$G$8,50,E6=$G$9,64,E6=$G$10,98,E6=$G$11,125,E6=$G$12,126)","v":""}]
[null,null,{"$f":"_xlfn.IFS(E7=\"\",0,E7=$G$5,'Cost Data'!$D$368,E7=$G$6,'Cost Data'!$D$369,E7=$G$7,'Cost Data'!$D$370,E7=$G$8,'Cost Data'!$D$371,E7=$G$9,'Cost Data'!$D$372,E7=$G$10,'Cost Data'!$D$373,E7=$G$11,'Cost Data'!$D$374,E7=$G$12,'Cost Data'!$D$375)","v":0},"Option 3",null,{"$f":"_xlfn.IFS(C13=\"EX810\",E17, C13=\"EX820\",E17, C13=\"EX830\",E17, C13=\"EX813\",E24, C13=\"EX823\",E24, C13=\"EX833\",E24, C13=\"EX816\",E34, C13=\"EX826\",E34, C13=\"EX836\",E34, C13=\"EX819\",E43, C13=\"EX829\",E43, C13=\"EX839\",E43,C13=\"Please Select\",\"\")","v":""},"*Immersible = -40",{"$f":"_xlfn.IFS(E7=\"\",\"\",E7=$G$5,15,E7=$G$6,32,E7=$G$7,40,E7=$G$8,50,E7=$G$9,64,E7=$G$10,98,E7=$G$11,125,E7=$G$12,126)","v":""}]
[null,null,{"$f":"_xlfn.IFS(E8=\"\",0,E8=$G$5,'Cost Data'!$D$368,E8=$G$6,'Cost Data'!$D$369,E8=$G$7,'Cost Data'!$D$370,E8=$G$8,'Cost Data'!$D$371,E8=$G$9,'Cost Data'!$D$372,E8=$G$10,'Cost Data'!$D$373,E8=$G$11,'Cost Data'!$D$374,E8=$G$12,'Cost Data'!$D$375)","v":0},"Option 4",null,{"$f":"_xlfn.IFS(C13=\"EX810\",E18, C13=\"EX820\",E18, C13=\"EX830\",E18, C13=\"EX813\",E25, C13=\"EX823\",E25, C13=\"EX833\",E25, C13=\"EX816\",E35, C13=\"EX826\",E35, C13=\"EX836\",E35, C13=\"EX819\",E44, C13=\"EX829\",E44, C13=\"EX839\",E44,C13=\"Please Select\",\"\")","v":""},"Low Power = -50",{"$f":"_xlfn.IFS(E8=\"\",\"\",E8=$G$5,15,E8=$G$6,32,E8=$G$7,40,E8=$G$8,50,E8=$G$9,64,E8=$G$10,98,E8=$G$11,125,E8=$G$12,126)","v":""}]
[null,null,{"$f":"_xlfn.IFS(E9=\"\",0,E9=$G$5,'Cost Data'!$D$368,E9=$G$6,'Cost Data'!$D$369,E9=$G$7,'Cost Data'!$D$370,E9=$G$8,'Cost Data'!$D$371,E9=$G$9,'Cost Data'!$D$372,E9=$G$10,'Cost Data'!$D$373,E9=$G$11,'Cost Data'!$D$374,E9=$G$12,'Cost Data'!$D$375)","v":0},"Option 5",null,{"$f":"_xlfn.IFS(C13=\"EX810\",\"\", C13=\"EX820\",\"\", C13=\"EX830\",\"\", C13=\"EX813\",E26, C13=\"EX823\",E26, C13=\"EX833\",E26, C13=\"EX816\",\"\", C13=\"EX826\",\"\", C13=\"EX836\",\"\", C13=\"EX819\",E45, C13=\"EX829\",E45, C13=\"EX839\",E45, C13=\"Please Select\",\"\")","v":""},"Non-resettable Total = 64",{"$f":"_xlfn.IFS(E9=\"\",\"\",E9=$G$5,15,E9=$G$6,32,E9=$G$7,40,E9=$G$8,50,E9=$G$9,64,E9=$G$10,98,E9=$G$11,125,E9=$G$12,126)","v":""}]
[null,null,{"$f":"_xlfn.IFS(E10=\"\",0,E10=$G$5,'Cost Data'!$D$368,E10=$G$6,'Cost Data'!$D$369,E10=$G$7,'Cost Data'!$D$370,E10=$G$8,'Cost Data'!$D$371,E10=$G$9,'Cost Data'!$D$372,E10=$G$10,'Cost Data'!$D$373,E10=$G$11,'Cost Data'!$D$374,E10=$G$12,'Cost Data'!$D$375)","v":0},"Option 6",null,{"$f":"_xlfn.IFS(C13=\"EX810\",\"\", C13=\"EX820\",\"\", C13=\"EX830\",\"\", C13=\"EX813\",E27, C13=\"EX823\",E27, C13=\"EX833\",E27, C13=\"EX816\",\"\", C13=\"EX826\",\"\", C13=\"EX836\",\"\", C13=\"EX819\",E46, C13=\"EX829\",E46, C13=\"EX839\",E46, C13=\"Please Select\",\"\")","v":""},"Dual Relay Output = 98",{"$f":"_xlfn.IFS(E10=\"\",\"\",E10=$G$5,15,E10=$G$6,32,E10=$G$7,40,E10=$G$8,50,E10=$G$9,64,E10=$G$10,98,E10=$G$11,125,E10=$G$12,126)","v":""}]
["Start",null,{"$f":"_xlfn.IFS(E11=\"\",0,E11=$G$5,'Cost Data'!$D$368,E11=$G$6,'Cost Data'!$D$369,E11=$G$7,'Cost Data'!$D$370,E11=$G$8,'Cost Data'!$D$371,E11=$G$9,'Cost Data'!$D$372,E11=$G$10,'Cost Data'!$D$373,E11=$G$11,'Cost Data'!$D$374,E11=$G$12,'Cost Data'!$D$375)","v":0},"Option 7",null,{"$f":"_xlfn.IFS(C13=\"EX810\",\"\", C13=\"EX820\",\"\", C13=\"EX830\",\"\", C13=\"EX813\",E28, C13=\"EX823\",E28, C13=\"EX833\",E28, C13=\"EX816\",\"\", C13=\"EX826\",\"\", C13=\"EX836\",\"\", C13=\"EX819\",E47, C13=\"EX829\",E47, C13=\"EX839\",E47, C13=\"Please Select\",\"\")","v":""},"Viton O-Ring = -125",{"$f":"_xlfn.IFS(E11=\"\",\"\",E11=$G$5,15,E11=$G$6,32,E11=$G$7,40,E11=$G$8,50,E11=$G$9,64,E11=$G$10,98,E11=$G$11,125,E11=$G$12,126)","v":""}]
["Here",null,null,"Option 8",null,null,"Hinged Display Cover = -126",{"$f":"_xlfn.IFS(E12=\"\",\"\",E12=$G$5,15,E12=$G$6,32,E12=$G$7,40,E12=$G$8,50,E12=$G$9,64,E12=$G$10,98,E12=$G$11,125,E12=$G$12,126)","v":""}]
[null,null,"Please Select","Please Select",{"$f":"_xlfn.TEXTJOIN(\"-\",TRUE,H5,H6,H7,H8,H9,H10,H11,H12)","v":""}]
[null,"Description","Size","Sensor Material","Options"]
["Sensor Only","Externally Powered (12 - 24vdc) Sensor only.","1\" - 3” = EX810","Brass = B","Reverse Flow Output = -15"]
[null,null,"4\" - 10” = EX820","316 Stainless = S","*Immersible = -40"]
[null,null,"12\" = EX830","PVC  = P","Low Power = -50","Low Power = -50","Low Power = -50"]
[null,null,null,null,"Viton O-Ring = -125","Viton O-Ring = -125","Viton O-Ring = -125"]
[]
[]
[null,"Description","Size","Sensor Material","Options"]
["FT430 Mounted        on Sensor","Externally powered sensor (12 - 24Vdc) with FT430 rate and total indicator (with pulse outputs) mounted on the sensor.","1\" - 3” = EX813","Brass = B","Reverse Flow Output = -15"]
[null,null,"4\" - 10” = EX823","316 Stainless = S","Tamper Evident Kit = -32","Tamper Evident Kit = -32","Tamper Evident Kit = -32"]
[null,null,"12\" = EX833","PVC  = P","Low Power = -50"]
[null,null,null,null,"Non-resettable Total = 64","Non-resettable Total = 64","Non-resettable Total = 64"]
[null,null,null,null,"Dual Relay Output = 98","Dual Relay Output = 98","Dual Relay Output = 98"]
[null,null,null,null,"Viton O-Ring = -125","Viton O-Ring = -125","Viton O-Ring = -125"]
[null,null,null,null,"Hinged Display Cover = -126"]
[]
[]
[null,"Description","Size","Sensor Material","Options"]
["DL76 Mounted on Sensor","Externally powered sensor (12 - 24vdc) with self powered DL76 data logger mounted on the sensor.","1\" - 3” = EX816","Brass = B","Reverse Flow Output = -15"]
[null,null,"4\" - 10” = EX826","316 Stainless = S","Tamper Evident Kit = -32","Tamper Evident Kit = -32","Tamper Evident Kit = -32"]
[null,null,"12\" = EX836","PVC  = P","Low Power = -50","Low Power = -50","Low Power = -50"]
[null,null,null,null,"Viton O-Ring = -125","Viton O-Ring = -125","Viton O-Ring = -125"]
[]
[]
[]
[]
["FT440 Mounted        on Sensor","Description","Size","Sensor Material","Options"]
[null,"Externally powered sensor (12 - 24Vdc) with FT440 rate and total indicator (with pulse and 4-20mA outputs) mounted on the sensor.","1\" - 3” = EX819","Brass = B","Reverse Flow Output = -15"]
[null,null,"4\" - 10” = EX829","316 Stainless = S","Tamper Evident Kit = -32","Tamper Evident Kit = -32","Tamper Evident Kit = -32"]
[null,null,"12\" = EX839","PVC  = P","Low Power = -50"]
[null,null,null,null,"Non-resettable Total = 64"]
[null,null,null,null,"Dual Relay Output = 98"]
[null,null,null,null,"Viton O-Ring = -125"]
[null,null,null,null,"Hinged Display Cover = -126"]
[]
[]
[]
["EX800 Series Tee Fittings"]
["Model #",null,"Description",null,null,null,"Price"]
[null,null,"Bronze"]
["EF81T-B-100",null,"Tee Fitting, Bronze, Threaded, 1\", EX ",null,null,null,{"$f":"'Cost Data'!D377","v":305}]
["EF81T-B-150",null,"Tee Fitting, Bronze, Threaded, 1-1/2\", EX ",null,null,null,{"$f":"'Cost Data'!D378","v":324}]
["EF81T-B-200",null,"Tee Fitting, Bronze, Threaded, 2\", EX ",null,null,null,{"$f":"'Cost Data'!D379","v":349}]
["EF81T-B-300",null,"Tee Fitting, Bronze, Threaded, 3\", EX ",null,null,null,{"$f":"'Cost Data'!D380","v":432}]
["EF81T-B-400",null,"Tee Fitting, Bronze, Threaded, 4\", EX ",null,null,null,{"$f":"'Cost Data'!D381","v":768}]
["EF81TC-B-100",null,"Tee Fitting, Bronze, Sweat, 1\", EX ",null,null,null,{"$f":"'Cost Data'!D382","v":335}]
["EF81TC-B-150",null,"Tee Fitting, Bronze, Sweat, 1-1/2\", EX ",null,null,null,{"$f":"'Cost Data'!D383","v":353}]
["EF81TC-B-200",null,"Tee Fitting, Bronze, Sweat, 2\", EX ",null,null,null,{"$f":"'Cost Data'!D384","v":380}]
["EF81TC-B-300",null,"Tee Fitting, Bronze, Sweat, 3\", EX ",null,null,null,{"$f":"'Cost Data'!D385","v":453}]
["EF81TC-B-400",null,"Tee Fitting, Bronze, Sweat, 4\", EX ",null,null,null,{"$f":"'Cost Data'!D386","v":769}]
[null,null,"PVC"]
["EF81T-P-100 ",null,"Tee Fitting, PVC, 1\", EX, Block Tee ",null,null,null,{"$f":"'Cost Data'!D387","v":161}]
["EF81T-P-150 ",null,"Tee Fitting, PVC, 1-1/2\", EX, Pipe Stub ",null,null,null,{"$f":"'Cost Data'!D388","v":146}]
["EF81T-P-200",null,"Tee Fitting, PVC, 2\", EX, Pipe Stub ",null,null,null,{"$f":"'Cost Data'!D389","v":153}]
["EF81T-P-200-18 ",null,"Tee Fitting, PVC, Flanged Ends, 2\",EX ",null,null,null,{"$f":"'Cost Data'!D390","v":279}]
[null,null,"Carbon Steel"]
["EF81T-C-100 ",null,"Tee Fitting, Carbon Steel, 1\", EX",null,null,null,{"$f":"'Cost Data'!D391","v":424}]
["EF81T-C-150 ",null,"Tee Fitting, Carbon Steel, 1-1/2\", EX",null,null,null,{"$f":"'Cost Data'!D392","v":500}]
["EF81T-C-200",null,"Tee Fitting, Carbon Steel, 2\", EX",null,null,null,{"$f":"'Cost Data'!D393","v":527}]
["EF81T-C-200-34 ",null,"Tee Fitting, Carbon Steel, Flanged Ends, 2\", EX",null,null,null,{"$f":"'Cost Data'!D394","v":849}]
[null,null,"Stainless Steel"]
["EF81T-S-100",null,"Tee Fitting, 304 SS, 1\", EX ",null,null,null,{"$f":"'Cost Data'!D395","v":603}]
["EF81T-S-150",null,"Tee Fitting, 304 SS, 1-1/2\", EX ",null,null,null,{"$f":"'Cost Data'!D396","v":616}]
["EF81T-S-200",null,"Tee Fitting, 304 SS, 2\", EX ",null,null,null,{"$f":"'Cost Data'!D397","v":637}]
["EF81T-S-100-14",null,"Tee Fitting, 316 SS, 1\", EX ",null,null,null,{"$f":"'Cost Data'!D398","v":874}]
["EF81T-S-150-14",null,"Tee Fitting, 316 SS, 1-1/2\", EX ",null,null,null,{"$f":"'Cost Data'!D399","v":903}]
["EF81T-S-200-14",null,"Tee Fitting, 316 SS, 2\", EX ",null,null,null,{"$f":"'Cost Data'!D400","v":948}]
["EF81T-S-200-20",null,"Tee Fitting, 304 SS, Flanged Ends, 2\", EX ",null,null,null,{"$f":"'Cost Data'!D401","v":1046}]
["EF81T-S-200-14-20",null,"Tee Fitting, 316 SS, Flanged Ends, 2\", EX ",null,null,null,{"$f":"'Cost Data'!D402","v":1368}]
["EX800 Series Saddle Fittings"]
["Model #",null,"Description",null,null,null,"Price"]
[null,null,"Ductile Iron"]
["EF82S-F-300",null,"Saddle, Iron, 3\", EX (3.45 - 4.05 O.D. range)",null,null,null,{"$f":"'Cost Data'!D404","v":426}]
["EF82S-F-400",null,"Saddle, Iron, 4\", EX (4.00 - 4.50 O.D. range)",null,null,null,{"$f":"'Cost Data'!D405","v":344}]
["EF82S-F-600",null,"Saddle, Iron, 6\", EX (6.00 - 6.63 O.D. range)",null,null,null,{"$f":"'Cost Data'!D406","v":399}]
["EF82S-F-800",null,"Saddle, Iron, 8\", EX (8.00 - 8.63 O.D. range)",null,null,null,{"$f":"'Cost Data'!D407","v":427}]
["EF82S-F-1000",null,"Saddle, Iron, 10\", EX (10.00 - 11.10 O.D. range)",null,null,null,{"$f":"'Cost Data'!D408","v":512}]
["EF82S-F-1200",null,"Saddle, Iron, 12\", EX (12.00 - 13.20 O.D. range)",null,null,null,{"$f":"'Cost Data'!D409","v":602}]
[null,null,"PVC"]
["EF82S-P-300",null,"Saddle, PVC, 3\", EX",null,null,null,{"$f":"'Cost Data'!D410","v":172}]
["EF82S-P-400",null,"Saddle, PVC, 4\", EX",null,null,null,{"$f":"'Cost Data'!D411","v":201}]
["EF82S-P-600",null,"Saddle, PVC, 6\", EX",null,null,null,{"$f":"'Cost Data'!D412","v":236}]
["EF82S-P-800",null,"Saddle, PVC, 8\", EX",null,null,null,{"$f":"'Cost Data'!D413","v":269}]
["EF82S-P-300-16",null,"Saddle, PVC, 3\",w/ 16\" Length Pipe Stub, EX",null,null,null,{"$f":"'Cost Data'!D414","v":224}]
["EF82S-P-400-16",null,"Saddle, PVC, 4\",w/ 16\" Length Pipe Stub, EX",null,null,null,{"$f":"'Cost Data'!D415","v":253}]
["EF82S-P-600-16",null,"Saddle, PVC, 6\",w/ 16\" Length Pipe Stub, EX",null,null,null,{"$f":"'Cost Data'!D416","v":292}]
["EF82S-P-800-16",null,"Saddle, PVC, 8\",w/ 16\" Length Pipe Stub, EX",null,null,null,{"$f":"'Cost Data'!D417","v":337}]
[null,null,"Bronze"]
["EF82S-B-300",null,"Saddle, Bronze, 3\", EX",null,null,null,{"$f":"'Cost Data'!D418","v":632}]
["EF82S-B-400",null,"Saddle, Bronze, 4\", EX",null,null,null,{"$f":"'Cost Data'!D419","v":667}]
["EX800 Series Weld/Braze Fittings"]
["Model #",null,"Description",null,null,null,"Price"]
[null,null,"Brass"]
["EF82W-B-300",null,"Weldolet, Brass, 3\", EX",null,null,null,{"$f":"'Cost Data'!D421","v":190}]
["EF82W-B-400",null,"Weldolet, Brass, 4\", EX",null,null,null,{"$f":"'Cost Data'!D422","v":190}]
["EF82W-B-600",null,"Weldolet, Brass, 6\", EX",null,null,null,{"$f":"'Cost Data'!D423","v":190}]
["EF82W-B-800",null,"Weldolet, Brass, 8\", EX",null,null,null,{"$f":"'Cost Data'!D424","v":190}]
["EF82W-B-1000",null,"Weldolet, Brass, 10\", EX",null,null,null,{"$f":"'Cost Data'!D425","v":190}]
["EF82W-B-1200",null,"Weldolet, Brass, 12\", EX",null,null,null,{"$f":"'Cost Data'!D426","v":190}]
[null,null,"Carbon Steel"]
["EF82W-C-300",null,"Weldolet, Carbon Steel, 3\", EX",null,null,null,{"$f":"'Cost Data'!D427","v":191}]
["EF82W-C-400",null,"Weldolet, Carbon Steel, 4\", EX",null,null,null,{"$f":"'Cost Data'!D428","v":191}]
["EF82W-C-600",null,"Weldolet, Carbon Steel, 6\", EX",null,null,null,{"$f":"'Cost Data'!D429","v":191}]
["EF82W-C-800",null,"Weldolet, Carbon Steel, 8\", EX",null,null,null,{"$f":"'Cost Data'!D430","v":191}]
["EF82W-C-1000",null,"Weldolet, Carbon Steel, 10\", EX",null,null,null,{"$f":"'Cost Data'!D431","v":191}]
["EF82W-C-1200",null,"Weldolet, Carbon Steel, 12\", EX",null,null,null,{"$f":"'Cost Data'!D432","v":191}]
[null,null,"Stainless Steel"]
["EF82W-S-300",null,"Weldolet, 316 SS, 3\", EX",null,null,null,{"$f":"'Cost Data'!D433","v":259}]
["EF82W-S-400",null,"Weldolet, 316 SS, 4\", EX",null,null,null,{"$f":"'Cost Data'!D434","v":259}]
["EF82W-S-600",null,"Weldolet, 316 SS, 6\", EX",null,null,null,{"$f":"'Cost Data'!D435","v":259}]
["EF82W-S-800",null,"Weldolet, 316 SS, 8\", EX",null,null,null,{"$f":"'Cost Data'!D436","v":259}]
["EF82W-S-1000",null,"Weldolet, 316 SS, 10\", EX",null,null,null,{"$f":"'Cost Data'!D437","v":259}]
["EF82W-S-1200",null,"Weldolet, 316 SS, 12\", EX",null,null,null,{"$f":"'Cost Data'!D438","v":259}]
["EX800 Series Parts & Accessories"]
["Model #",null,"Description",null,null,null,"Price"]
[100248,null,"Cap, Blind, PVC, EX/IP/TX800 series",null,null,null,{"$f":"'Cost Data'!D440","v":49}]
[100249,null,"Cap, Blind, Polypro, EX/IP/TX800 series",null,null,null,{"$f":"'Cost Data'!D441","v":49}]
[100250,null,"Cap, Blind, SS, EX/IP/TX800 series",null,null,null,{"$f":"'Cost Data'!D442","v":97}]
[100251,null,"Cap, Blind, Brass, EX/IP/TX800 Series",null,null,null,{"$f":"'Cost Data'!D443","v":72}]
[101850,null,"Strain Relief Kit Large, 1/2\", NPT",null,null,null,{"$f":"'Cost Data'!D444","v":21}]
[100411,null,"Gasket, Upper Housing",null,null,null,{"$f":"'Cost Data'!D445","v":16}]
[102021,null,"Hinged Display Cover Kit",null,null,null,{"$f":"'Cost Data'!D446","v":64}]
[100662,null,"Housing Assy, Upper, Blind (Gasket, Screws, Washers, Label)",null,null,null,{"$f":"'Cost Data'!D447","v":63}]
[103702,null,"White Housing Screw/Washer Kit",null,null,null,{"$f":"'Cost Data'!D448","v":4}]
[100264,null,"O-Ring, EPDM, Sensor Shaft",null,null,null,{"$f":"'Cost Data'!D449","v":17}]
[100219,null,"O-Ring, Viton®, Brown",null,null,null,{"$f":"'Cost Data'!D450","v":21}]
[100414,null,"Screw/Washer Kit, Upper Housing (Qty 4)",null,null,null,{"$f":"'Cost Data'!D451","v":3}]
[100853,null,"Security Seal, w/12\" of Wire",null,null,null,{"$f":"'Cost Data'!D452","v":5}]
[100854,null,"Wire, for Security Seal, 12\" (For 3\" Only)",null,null,null,{"$f":"'Cost Data'!D453","v":3}]
[104000,null,"Standard U-Clip",null,null,null,{"$f":"'Cost Data'!D454","v":15}]
[100763,null,"Standard Retaining Pin (2 Required)",null,null,null,{"$f":"'Cost Data'!D455","v":22}]
[103319,null,"Security Screw Kit, 10-24 x 0.625\",",null,null,null,{"$f":"'Cost Data'!D456","v":15}]
[]
["Cables & Connectors"]
["Model #",null,"Description",null,null,null,"Price"]
[100852,null,"Cable, Shielded, 4-Con, EX W/O Reverse Flow (Per Ft.)",null,null,null,{"$f":"'Cost Data'!D898","v":5}]
[100835,null,"Cable, Shielded, 6-Con, EX W/ Reverse Flow (Per Ft.)",null,null,null,{"$f":"'Cost Data'!D899","v":6}]
[100010,null,"Cable, Unshielded, 2 Con, MJ-WJ-AO55 (Per Ft.)",null,null,null,{"$f":"'Cost Data'!D900","v":3}]
[100451,null,"Cable, Unshielded, 3 Con, Blue, Low Power, IP-TX-WT-S Series (Per Ft.)",null,null,null,{"$f":"'Cost Data'!D901","v":3}]
[100011,null,"Cable, Unshielded, 3 Con, Grey Micropower (IP,TX,WT,SPX,SPT,SES)",null,null,null,{"$f":"'Cost Data'!D902","v":3}]
[100014,null,"Cable, Unshielded, 4 Con, FT440, (Per Ft.)",null,null,null,{"$f":"'Cost Data'!D903","v":4}]
[100649,null,"Cable, Unshielded, 3 Con, MJE (Per Ft.)",null,null,null,{"$f":"'Cost Data'!D904","v":3}]
[100008,null,"Connector, Female, LMI 4pin, Female",null,null,null,{"$f":"'Cost Data'!D905","v":40}]
[100006,null,"Connector, Seametrics 3-Pin BulkHead",null,null,null,{"$f":"'Cost Data'!D906","v":40}]
[100007,null,"Connector, Seametrics 3-Pin Cable End",null,null,null,{"$f":"'Cost Data'!D907","v":40}]
[101783,null,"Roytronics® Series-A Pump 5 Pin Connector",null,null,null,{"$f":"'Cost Data'!D908","v":41}]
[]
["Cables & Connectors Assemblies"]
["Model #",null,"Description",null,null,null,"Price"]
[100039,null,"Cable Assy, 12' Unshielded, 2 Con, LMI 4-Pin Connector",null,null,null,{"$f":"'Cost Data'!D910","v":54}]
[100013,null,"Cable Assy, 12' Unshielded, 3 Con, LMI 4-Pin Connector, 1K Resistor","Cable Assy, 12' Unshielded, 3 Con, LMI 4-Pin Connector, 1K Resistor","Cable Assy, 12' Unshielded, 3 Con, LMI 4-Pin Connector, 1K Resistor","Cable Assy, 12' Unshielded, 3 Con, LMI 4-Pin Connector, 1K Resistor",{"$f":"'Cost Data'!D911","v":54}]
[100395,null,"Cable Assy, 12' Unshielded, 2 Con, Seametrics 3-Pin Connector","Cable Assy, 12' Unshielded, 2 Con, Seametrics 3-Pin Connector","Cable Assy, 12' Unshielded, 2 Con, Seametrics 3-Pin Connector","Cable Assy, 12' Unshielded, 2 Con, Seametrics 3-Pin Connector",{"$f":"'Cost Data'!D912","v":54}]
[100041,null,"Cable Assy, 12' Unshielded, 3 Con, Seametrics 3-Pin Connector","Cable Assy, 12' Unshielded, 3 Con, Seametrics 3-Pin Connector","Cable Assy, 12' Unshielded, 3 Con, Seametrics 3-Pin Connector","Cable Assy, 12' Unshielded, 3 Con, Seametrics 3-Pin Connector",{"$f":"'Cost Data'!D913","v":54}]
[101587,null,"Cable Assy, 12' Unshielded, 2 Con, LMI 5-Pin Connector","Cable Assy, 12' Unshielded, 2 Con, LMI 5-Pin Connector","Cable Assy, 12' Unshielded, 2 Con, LMI 5-Pin Connector","Cable Assy, 12' Unshielded, 2 Con, LMI 5-Pin Connector",{"$f":"'Cost Data'!D914","v":54}]
[101576,null,"Cable Assy, 12' Unshielded, 3 Con, LMI 5-Pin Connector","Cable Assy, 12' Unshielded, 3 Con, LMI 5-Pin Connector","Cable Assy, 12' Unshielded, 3 Con, LMI 5-Pin Connector","Cable Assy, 12' Unshielded, 3 Con, LMI 5-Pin Connector",{"$f":"'Cost Data'!D915","v":54}]
[100044,null,"Sensor Assy, MJR, Single Reed Switch, LMI Pump 4-Pin Connector","Sensor Assy, MJR, Single Reed Switch, LMI Pump 4-Pin Connector","Sensor Assy, MJR, Single Reed Switch, LMI Pump 4-Pin Connector","Sensor Assy, MJR, Single Reed Switch, LMI Pump 4-Pin Connector",{"$f":"'Cost Data'!D916","v":113}]
[100045,null,"Sensor Assy, MJR, Dual Reed Switch, LMI Pump 4-Pin Connector","Sensor Assy, MJR, Dual Reed Switch, LMI Pump 4-Pin Connector","Sensor Assy, MJR, Dual Reed Switch, LMI Pump 4-Pin Connector","Sensor Assy, MJR, Dual Reed Switch, LMI Pump 4-Pin Connector",{"$f":"'Cost Data'!D917","v":123}]
[100049,null,"Sensor Assy, MJE, Single Hall Effect, LMI Pump 4-Pin Connector","Sensor Assy, MJE, Single Hall Effect, LMI Pump 4-Pin Connector","Sensor Assy, MJE, Single Hall Effect, LMI Pump 4-Pin Connector","Sensor Assy, MJE, Single Hall Effect, LMI Pump 4-Pin Connector",{"$f":"'Cost Data'!D918","v":113}]
[100046,null,"Sensor Assy, MJR, Single Reed Switch, Seametrics Control Connector","Sensor Assy, MJR, Single Reed Switch, Seametrics Control Connector","Sensor Assy, MJR, Single Reed Switch, Seametrics Control Connector","Sensor Assy, MJR, Single Reed Switch, Seametrics Control Connector",{"$f":"'Cost Data'!D919","v":113}]
[100047,null,"Sensor Assy, MJR, Dual Reed Switch, Seametrics Control Connector","Sensor Assy, MJR, Dual Reed Switch, Seametrics Control Connector","Sensor Assy, MJR, Dual Reed Switch, Seametrics Control Connector","Sensor Assy, MJR, Dual Reed Switch, Seametrics Control Connector",{"$f":"'Cost Data'!D920","v":123}]
[100048,null,"Sensor Assy, MJE, Single Hall Effect, Seametrics Control Cable","Sensor Assy, MJE, Single Hall Effect, Seametrics Control Cable","Sensor Assy, MJE, Single Hall Effect, Seametrics Control Cable","Sensor Assy, MJE, Single Hall Effect, Seametrics Control Cable",{"$f":"'Cost Data'!D921","v":113}]
[101588,null,"Sensor Assy, MJR, Single Reed Switch, LMI Pump 5-Pin Connector","Sensor Assy, MJR, Single Reed Switch, LMI Pump 5-Pin Connector","Sensor Assy, MJR, Single Reed Switch, LMI Pump 5-Pin Connector","Sensor Assy, MJR, Single Reed Switch, LMI Pump 5-Pin Connector",{"$f":"'Cost Data'!D922","v":113}]
[101589,null,"Sensor Assy, MJR, Dual Reed SW, LMI Pump 5-Pin Connector","Sensor Assy, MJR, Dual Reed SW, LMI Pump 5-Pin Connector","Sensor Assy, MJR, Dual Reed SW, LMI Pump 5-Pin Connector","Sensor Assy, MJR, Dual Reed SW, LMI Pump 5-Pin Connector",{"$f":"'Cost Data'!D923","v":113}]
[101590,null,"Sensor Assy, MJE, Single Hall Effect, LMI Pump 5-Pin Connector","Sensor Assy, MJE, Single Hall Effect, LMI Pump 5-Pin Connector","Sensor Assy, MJE, Single Hall Effect, LMI Pump 5-Pin Connector","Sensor Assy, MJE, Single Hall Effect, LMI Pump 5-Pin Connector",{"$f":"'Cost Data'!D924","v":123}]

{"sheet":"EX90","index":6,"n_rows":48,"n_cols":8,"rows_kept":48,"cut":false,"hidden":false,"merged":[[19,1,19,2],[19,3,19,6],[18,1,18,7],[37,1,37,7],[20,1,20,2],[20,3,20,6],[35,1,35,2],[35,3,35,6],[32,1,32,2],[32,3,32,6],[33,1,33,2],[33,3,33,6],[34,1,34,2],[34,3,34,6],[28,1,28,2],[28,3,28,6],[44,1,44,2],[25,1,25,2],[25,3,25,6],[26,3,26,6],[27,1,27,2],[27,3,27,6],[26,1,26,2],[30,1,30,2],[30,3,30,6],[39,8,47,8],[0,5,0,6],[1,5,1,6],[2,5,2,6],[3,5,3,6],[4,5,4,6],[5,5,5,6],[47,3,47,6],[38,1,38,7],[45,1,45,2],[46,1,46,2],[47,1,47,2],[39,3,39,6],[40,3,40,6],[41,3,41,6],[42,3,42,6],[1,0,7,0],[3,3,7,3],[14,1,14,4],[6,5,6,6],[7,5,7,6],[12,5,12,6],[46,3,46,6],[23,3,23,6],[24,1,24,2],[39,1,39,2],[43,1,43,2],[29,1,29,2],[29,3,29,6],[31,1,31,2],[31,3,31,6],[24,3,24,6],[43,3,43,6],[44,3,44,6],[45,3,45,6],[40,1,40,2],[41,1,41,2],[42,1,42,2],[21,1,21,2],[21,3,21,6],[22,1,22,2],[22,3,22,6],[23,1,23,2]]}
[null,"EX90",{"$f":"_xlfn.IFS(C3=\"\",\" \",C3=4,\"0400\",C3=6,\"0600\",C3=8,\"0800\",C3=10,\"1000\",C3=12,\"1200\")","v":" "},"BX","X",{"$f":"IF(F3=\"Yes\", \"01\", \"XX\")","v":"XX"},null,{"$f":"_xlfn.IFS(H3=\"0064\", \"0064\",H3=\"0154\", \"0154\",H3= \"0304\", \"0304\",H3= \"0454\", \"0454\",H3= \"0604\", \"0604\",H3=\"None\",\"0000\")","v":{"$error":"#N/A"}}]
["EX90",null,"Size","Power","Optional output                                         (Comes Standard with one pulse output)","Options",null,"Power/Output Cable (Must Select One)"]
[null,null,null,"BX - Battery","X (Single Cable for DC Power & output)"]
[null,null,"0400 4\"","BX - Battery",null,".-XX None",null,"0064 = 6m (20ft)"]
[null,null,"0600 6\"",null,null,".-01 Data Logger",null,"0154 = 15m (50ft)"]
[null,null,"0800 8\"",null,null,null,null,"0304 = 30m (100ft)"]
[null,null,"1000 10\"",null,null,null,null,"0454 = 45m (150ft)"]
[null,null,"1200 12\"",null,null,null,null,"0604 = 60m (200ft)"]
[]
[]
[]
[]
[]
[]
[null,{"$f":"_xlfn.TEXTJOIN(\"-\",TRUE,B1:H1)","v":{"$error":"#N/A"}}]
[null,null,"Meter ","Power","Optional Output","Data Logger","Output Cable","List Price"]
[null,"Meter",{"$f":"_xlfn.IFS(C3=4, 'Cost Data'!D117,C3=6, 'Cost Data'!D118,C3=8, 'Cost Data'!D119,C3=10, 'Cost Data'!D120,C3=12, 'Cost Data'!D121)","v":{"$error":"#N/A"}},0,0,{"$f":"IF(F1=\"01\", 'Cost Data'!D127,0)","v":0},{"$f":"_xlfn.IFS(H1=\"0064\",'Cost Data'!D122,H1=\"0154\",'Cost Data'!D123,H1=\"0304\",'Cost Data'!D124,H1=\"0454\",'Cost Data'!D125,H1=\"0604\",'Cost Data'!D126,H1=\"0000\",0)","v":{"$error":"#N/A"}},{"$f":"SUM(C17:G17)","v":{"$error":"#N/A"}}]
[]
[null,"EX90 Parts & Accessories"]
[null,"Model #",null,"Description",null,null,null,"Price"]
[null,103971,null,"Battery Replacement Kit, (2) D-Cell",null,null,null,{"$f":"'Cost Data'!D137","v":126}]
[null,104009,null,"Security U-Clip Kit",null,null,null,{"$f":"'Cost Data'!D139","v":36}]
[null,100264,null,"O-Ring, EPDM, Sensor Shaft",null,null,null,{"$f":"'Cost Data'!D140","v":17}]
[null,"103038-03-245",null," O-Ring, EPDM, Display Housing",null,null,null,{"$f":"'Cost Data'!D141","v":8}]
[null,103500,null,"Security Seal, Plastic Padlock",null,null,null,{"$f":"'Cost Data'!D142","v":2}]
[null,104073,null,"Security Tab",null,null,null,{"$f":"'Cost Data'!D143","v":2}]
[null,"103490-01",null,"01 Display Cover, White",null,null,null,{"$f":"'Cost Data'!D144","v":14}]
[null,"103709-01",null,"01 Display Cover Kit, with Lanyard & Split Key Ring",null,null,null,{"$f":"'Cost Data'!D145","v":36}]
[null,103984,null,"Hinged Display Cover Kit",null,null,null,{"$f":"'Cost Data'!D146","v":36}]
[null,"DC4-USB",null,"Data Logger Download Cable, IP68",null,null,null,{"$f":"'Cost Data'!D147","v":207}]
[null,"DC5-USB",null,"Data Logger Download Cable, IP68",null,null,null,{"$f":"'Cost Data'!D148","v":200}]
[null,102009,null,"Data Logger Connector Cap",null,null,null,{"$f":"'Cost Data'!D149","v":23}]
[null,100248,null,"Cap, Blind, PVC, EX/IP/TX800 series",null,null,null,{"$f":"'Cost Data'!D150","v":49}]
[null,100249,null,"Cap, Blind, Polypro, EX/IP/TX800 series",null,null,null,{"$f":"'Cost Data'!D151","v":49}]
[null,100250,null,"Cap, Blind, SS, EX/IP/TX800 series",null,null,null,{"$f":"'Cost Data'!D152","v":97}]
[null,100251,null,"Cap, Blind, Brass, EX/IP/TX800 Series",null,null,null,{"$f":"'Cost Data'!D153","v":72}]
[]
[null,"Note: Saddle is included with EX90 purchase. Items below for after sale purchase."]
[null,"EX90 Saddles & Gaskets"]
[null,"103977-04",null,"4 Inch Saddle (4.00\" - 4.90\" O.D. range) ",null,null,null,{"$f":"'Cost Data'!D128","v":159}]
[null,"103977-06",null,"6 Inch Saddle (6.00\" - 6.90\" O.D. range) ",null,null,null,{"$f":"'Cost Data'!D129","v":185}]
[null,"103977-08",null,"8 Inch Saddle (8.00\" - 9.05\" O.D. range) ",null,null,null,{"$f":"'Cost Data'!D130","v":203}]
[null,"103977-10",null,"10 Inch Saddle (10.40\" - 11.10\" O.D. range) ",null,null,null,{"$f":"'Cost Data'!D131","v":224}]
[null,"103977-12",null,"12 Inch Saddle (12.10\" - 13.20\" O.D. range) ",null,null,null,{"$f":"'Cost Data'!D132","v":239}]
[null,"104084-04",null,"4 Inch Saddle Gasket ",null,null,null,{"$f":"'Cost Data'!D133","v":13}]
[null,"104084-06",null,"6 Inch Saddle Gasket ",null,null,null,{"$f":"'Cost Data'!D134","v":15}]
[null,"104084-08",null,"8 Inch Saddle Gasket ",null,null,null,{"$f":"'Cost Data'!D135","v":18}]
[null,"104084-1012",null,"10 or 12 Inch Saddle Gasket ",null,null,null,{"$f":"'Cost Data'!D136","v":21}]

{"sheet":"iMAG4700","index":7,"n_rows":145,"n_cols":14,"rows_kept":145,"cut":false,"hidden":false,"merged":[[84,1,84,2],[84,3,84,9],[111,1,111,2],[111,3,111,9],[120,1,120,2],[120,3,120,9],[129,1,129,2],[129,3,129,9],[138,1,138,2],[138,3,138,9],[133,1,133,2],[133,3,133,9],[127,1,127,10],[128,1,128,2],[128,3,128,9],[130,1,130,2],[130,3,130,9],[124,1,124,2],[124,3,124,9],[125,1,125,2],[125,3,125,9],[126,1,126,2],[126,3,126,9],[121,1,121,2],[144,1,144,2],[144,3,144,9],[89,3,89,9],[141,1,141,2],[141,3,141,9],[142,1,142,2],[142,3,142,9],[143,1,143,2],[143,3,143,9],[137,1,137,2],[137,3,137,9],[139,1,139,2],[139,3,139,9],[140,1,140,2],[140,3,140,9],[134,1,134,2],[134,3,134,9],[135,1,135,2],[135,3,135,9],[136,1,136,10],[131,1,131,2],[131,3,131,9],[132,1,132,2],[132,3,132,9],[121,3,121,9],[122,1,122,2],[122,3,122,9],[123,1,123,2],[123,3,123,9],[117,1,117,2],[117,3,117,9],[118,1,118,10],[119,1,119,2],[119,3,119,9],[114,1,114,2],[114,3,114,9],[115,1,115,2],[115,3,115,9],[116,1,116,2],[116,3,116,9],[110,1,110,2],[110,3,110,9],[112,1,112,2],[112,3,112,9],[113,1,113,2],[113,3,113,9],[106,1,106,2],[106,3,106,9],[108,1,108,2],[108,3,108,9],[109,1,109,10],[103,1,103,2],[103,3,103,9],[104,1,104,2],[104,3,104,9],[105,1,105,2],[105,3,105,9],[107,1,107,2],[107,3,107,9],[100,1,100,2],[100,3,100,9],[101,1,101,2],[101,3,101,9],[102,1,102,2],[102,3,102,9],[97,1,97,2],[97,3,97,9],[98,1,98,2],[98,3,98,9],[99,1,99,2],[99,3,99,9],[94,1,94,2],[94,3,94,9],[95,1,95,2],[95,3,95,9],[96,1,96,2],[96,3,96,9],[91,1,91,2],[91,3,91,9],[92,1,92,2],[92,3,92,9],[93,1,93,2],[93,3,93,9],[88,1,88,2],[88,3,88,9],[89,1,89,2],[90,1,90,2],[90,3,90,9],[85,1,85,2],[85,3,85,9],[86,1,86,2],[86,3,86,9],[87,1,87,2],[87,3,87,9],[81,1,81,2],[81,3,81,9],[82,1,82,2],[82,3,82,9],[83,1,83,2],[83,3,83,9],[78,1,78,2],[78,3,78,9],[79,1,79,2],[79,3,79,9],[80,1,80,2],[80,3,80,9],[75,1,75,2],[75,3,75,9],[76,1,76,2],[76,3,76,9],[77,1,77,2],[77,3,77,9],[72,1,72,2],[72,3,72,9],[73,1,73,2],[73,3,73,9],[74,1,74,2],[74,3,74,9],[69,1,69,2],[69,3,69,9],[70,1,70,2],[70,3,70,9],[71,1,71,2],[71,3,71,9],[61,1,61,10],[62,1,62,2],[62,3,62,9],[68,1,68,2],[68,3,68,9],[63,1,63,2],[63,3,63,9],[64,1,64,2],[64,3,64,9],[65,1,65,2],[65,3,65,9],[66,1,66,2],[66,3,66,9],[67,1,67,2],[67,3,67,9],[57,1,57,2],[11,1,11,10],[31,1,31,10],[52,1,52,10],[32,1,32,10],[35,1,35,4],[36,1,36,2],[43,5,46,5],[47,5,50,5],[16,1,16,2],[23,5,25,5],[26,5,29,5],[57,5,57,9],[1,0,9,0],[3,5,6,5],[7,5,9,5],[12,1,12,10],[15,1,15,4],[15,5,15,9],[53,1,53,10],[56,1,56,4],[41,0,50,0],[21,0,29,0],[0,9,10,11],[20,9,29,11],[40,10,50,11],[16,5,16,9],[36,5,36,9]]}
[null,"iMAG4700",{"$f":"_xlfn.IFS(C3=2,\"-0200\",C3=3,\"-0300\",C3=4,\"-0400\",C3=6,\"-0600\",C3=8,\"-0800\",C3=10,\"-1000\",C3=12,\"-1200\")","v":{"$error":"#N/A"}},{"$f":"IF(D3=\"F1\", \"-F1\", 0)","v":"-F1"},{"$f":"_xlfn.IFS(E3=\"NSF\", \"-P\", E3=\"Non-NSF\", \"-R\")","v":{"$error":"#N/A"}},{"$f":"_xlfn.IFS(F3=\"DC\", \"-D1\", F3=\"Battery\", \"-BX\")","v":{"$error":"#N/A"}},{"$f":"_xlfn.IFS(G3= \"Please Select\", \"#N/A\",G3=\"No Optional Output Connector\", \"-X\",G3= \"_4_20mA Connector\", \"-L\",G3= \"Modbus Connector\", \"-S\")","v":"#N/A"},{"$f":"IF(H3=\"Yes\", \"-01\", \"-XX\")","v":"-XX"},{"$f":"_xlfn.IFS(I3=\".-0064\", \"-0064\",I3=\".-0154\", \"-0154\",I3= \".-0304\", \"-0304\",I3= \".-0454\", \"-0454\",I3= \".-0604\", \"-0604\",I3=\".-0068\", \"-0068\",I3=\".-0158\", \"-0158\",I3= \".-0308\", \"-0308\",I3= \".-0458\", \"-0458\",I3= \".-0608\", \"-0608\",I3=0,\"-0000\")","v":{"$error":"#N/A"}}]
["iMAG4700 (Integrated Display)",null,"Size","Style","Gaskets","Power","Optional output (Pulse is standard)","Data Logger","Cables"]
[null,null,null,"F1",null,null,"Please Select",null,"Please Select"]
[null,null,".-0200 2\"",".-F1",".- X",".-D1 - DC",".-X (requires 4 conductor cable)",".-XX None","006X = 6m (20ft)"]
[null,null,".-0300 3\"",null,".-R Non NSF",null,".-L (requires 8 conductor cable)",".-01 Data Logger","015X = 15m (50ft)"]
[null,null,".-0400 4\"",null,".-P NSF",null,".-S (requires 8 conductor cable)",null,"030X = 30m (100ft)"]
[null,null,".-0600 6\"",null,null,null,null,null,"045X = 45m (150ft)"]
[null,null,".-0800 8\"",null,null,".-BX - Battery",null,null,"060X = 60m (200ft)"]
[null,null,".-1000 10\"",null,null,null,".-X (requires 4 conductor cable)",null,"X could 4 or 8 "]
[null,null,".-1200 12\"",null,null,null,".-S (requires 8 conductor cable)",null,"depending on output"]
[]
[null,"BASE MODEL"]
[null,{"$f":"_xlfn.TEXTJOIN(\"\",TRUE,B1:I1)","v":{"$error":"#N/A"}}]
[null,null,"Meter ",null,"Gasket","Power","Optional Output","Data Logger","Output Cable",null,"List Price"]
[null,"Meter",{"$f":"_xlfn.IFS(C3=2, 'Cost Data'!D2,C3=3, 'Cost Data'!D3, C3=4, 'Cost Data'!D4,C3=6, 'Cost Data'!D5,C3=8, 'Cost Data'!D6,C3=10, 'Cost Data'!D7,C3=12, 'Cost Data'!D8)","v":{"$error":"#N/A"}},{"$f":"_xlfn.IFS(C3=2,'Cost Data'!D9,C3=3,'Cost Data'!D10,C3=4,'Cost Data'!D11,C3=6,'Cost Data'!D12,C3=8,'Cost Data'!D13,C3=10,'Cost Data'!D14,C3=12,'Cost Data'!D15)","v":{"$error":"#N/A"}},{"$f":"IF(E1=\"-P\",D15,0)","v":{"$error":"#N/A"}},0,{"$f":"_xlfn.IFS(G1=\"-L\",'Cost Data'!D16,G1=\"-H\",'Cost Data'!D17,G1= \"-S\",'Cost Data'!D18,G1= \"-X\",0)","v":{"$error":"#N/A"}},{"$f":"IF(H1=\"-01\", 'Cost Data'!D19,0)","v":0},{"$f":"_xlfn.IFS(I1=\"-0068\",'Cost Data'!D20,I1=\"-0158\",'Cost Data'!D21,I1=\"-0308\",'Cost Data'!D22,I1=\"-0458\",'Cost Data'!D23,I1=\"-0608\",'Cost Data'!D24,I1=\"-0064\",'Cost Data'!D25,I1=\"-0154\",'Cost Data'!D26,I1=\"-0304\",'Cost Data'!D27,I1=\"-0454\",'Cost Data'!D28,I1=\"-0604\",'Cost Data'!D29,I1=\"-0000\",0)","v":{"$error":"#N/A"}},null,{"$f":"(C15+E15+F15+G15+H15+I15)","v":{"$error":"#N/A"}}]
[null,{"$f":"B13","v":{"$error":"#N/A"}},null,null,null,null,null,null,null,null,null,null,null,{"$f":"_xlfn.TEXTJOIN(\"\",TRUE,C1:E1)","v":{"$error":"#N/A"}}]
[null,{"$f":"_xlfn.IFS(N16=\"-0200-F1-R\",'Cost Data'!B989,N16=\"-0200-F1-P\",'Cost Data'!B997,N16=\"-0300-F1-R\",'Cost Data'!B990,N16=\"-0300-F1-P\",'Cost Data'!B998,N16=\"-0400-F1-R\",'Cost Data'!B991,N16=\"-0400-F1-P\",'Cost Data'!B999,N16=\"-0600-F1-R\",'Cost Data'!B992,N16=\"-0600-F1-P\",'Cost Data'!B1000,N16=\"-0800-F1-R\",'Cost Data'!B993,N16=\"-0800-F1-P\",'Cost Data'!B1001,N16=\"-1000-F1-R\",'Cost Data'!B994,N16=\"-1000-F1-P\",'Cost Data'!B1002,N16=\"-1200-F1-R\",'Cost Data'!B995,N16=\"-1200-F1-P\",'Cost Data'!B1003)","v":{"$error":"#N/A"}},null,null,null,{"$f":"_xlfn.IFS(N16=\"-0200-F1-R\",'Cost Data'!C989,N16=\"-0200-F1-P\",'Cost Data'!C997,N16=\"-0300-F1-R\",'Cost Data'!C990,N16=\"-0300-F1-P\",'Cost Data'!C998,N16=\"-0400-F1-R\",'Cost Data'!C991,N16=\"-0400-F1-P\",'Cost Data'!C999,N16=\"-0600-F1-R\",'Cost Data'!C992,N16=\"-0600-F1-P\",'Cost Data'!C1000,N16=\"-0800-F1-R\",'Cost Data'!C993,N16=\"-0800-F1-P\",'Cost Data'!C1001,N16=\"-1000-F1-R\",'Cost Data'!C994,N16=\"-1000-F1-P\",'Cost Data'!C1002,N16=\"-1200-F1-R\",'Cost Data'!C995,N16=\"-1200-F1-P\",'Cost Data'!C1003)","v":{"$error":"#N/A"}},null,null,null,null,{"$f":"_xlfn.IFS(N16=\"-0200-F1-R\",'Cost Data'!D989,N16=\"-0200-F1-P\",'Cost Data'!D997,N16=\"-0300-F1-R\",'Cost Data'!D990,N16=\"-0300-F1-P\",'Cost Data'!D998,N16=\"-0400-F1-R\",'Cost Data'!D991,N16=\"-0400-F1-P\",'Cost Data'!D999,N16=\"-0600-F1-R\",'Cost Data'!D992,N16=\"-0600-F1-P\",'Cost Data'!D1000,N16=\"-0800-F1-R\",'Cost Data'!D993,N16=\"-0800-F1-P\",'Cost Data'!D1001,N16=\"-1000-F1-R\",'Cost Data'!D994,N16=\"-1000-F1-P\",'Cost Data'!D1002,N16=\"-1200-F1-R\",'Cost Data'!D995,N16=\"-1200-F1-P\",'Cost Data'!D1003)","v":{"$error":"#N/A"}}]
[null,null,null,null,null,null,null,null,null,"Total",{"$f":"K15+K17","v":{"$error":"#N/A"}}]
[]
[]
[null,"iMAG4700p",{"$f":"_xlfn.IFS(C23=2,\"-0200\",C23=3,\"-0300\",C23=4,\"-0400\",C23=6,\"-0600\",C23=8,\"-0800\",C23=10,\"-1000\",C23=12,\"-1200\")","v":{"$error":"#N/A"}},{"$f":"IF(D23=\"F1\", \"-F1\", 0)","v":"-F1"},{"$f":"_xlfn.IFS(E23=\"NSF\", \"-P\", E23=\"Non-NSF\", \"-R\")","v":{"$error":"#N/A"}},{"$f":"_xlfn.IFS(F23=\"D.C.\", \"-D1\", F23=\"A.C.\", \"-A1\")","v":{"$error":"#N/A"}},{"$f":"_xlfn.IFS(G23=\"No Optional Output\", \"-X\",G23= \"Fourto20mA\", \"-L\",G23= \"DC_Modbus\", \"-S\",G23= \"HART\", \"-H\",G23= \"AC_Modbus\", \"-S\")","v":{"$error":"#N/A"}},{"$f":"IF(H23=\"Yes\", \"-01\", \"-XX\")","v":"-XX"},{"$f":"_xlfn.IFS(I23=\".-006S\",\"-006S\",I23=\".-015S\",\"-015S\",I23=\".-030S\",\"-030S\",I23=\".-045S\",\"-045S\",I23=\".-060S\",\"-060S\",I23=\".-006D\",\"-006D\",I23=\".-015D\",\"-015D\",I23=\".-030D\",\"-030D\",I23=\".-045D\",\"-045D\",I23=\".-060D\",\"-060D\",I23=0,\"-0000\")","v":{"$error":"#N/A"}}]
["iMAG4700p (Integrated Display)",null,null,"Style",null,null,"Please Select",null,"Please Select"]
[null,null,null,"F1",null,null,"Please Select",null,"Please Select"]
[null,null,".-0200 2\"",".-F1",".- X",".-D1 - DC",".-X (Single Cable for DC Power & output)",".-XX None","6m (20ft)"]
[null,null,".-0300 3\"",null,".-R Non NSF",null,".-H (Single Cable for DC Power & output)",".-01 Data Logger","15m (50ft)"]
[null,null,".-0400 4\"",null,".-P NSF",null,".-S (Dual Cable for DC Power & output)",null,"30m (100ft)"]
[null,null,".-0600 6\"",null,null,".-A1 - AC",".-X (Single Cable for output)",null,"45m (150ft)"]
[null,null,".-0800 8\"",null,null,null,".-H (Single Cable for output)",null,"60m (200ft)"]
[null,null,".-1000 10\"",null,null,null,".-S  (Single Cable for output)"]
[null,null,".-1200 12\""]
[]
[null,"PREMIUM MODEL"]
[null,{"$f":"_xlfn.TEXTJOIN(\"\",TRUE,B21:I21)","v":{"$error":"#N/A"}}]
[null,null,"Meter ",null,"Gasket","Power","Optional Output","Data Logger","Output Cable",null,"List Price"]
[null,"Meter",{"$f":"_xlfn.IFS(C23=2, 'Cost Data'!D30,C23=3, 'Cost Data'!D31, C23=4, 'Cost Data'!D32,C23=6, 'Cost Data'!D33,C23=8, 'Cost Data'!D34,C23=10, 'Cost Data'!D35,C23=12, 'Cost Data'!D36)","v":{"$error":"#N/A"}},{"$f":"_xlfn.IFS(C23=2,'Cost Data'!D37,C23=3,'Cost Data'!D38,C23=4,'Cost Data'!D39,C23=6,'Cost Data'!D40,C23=8,'Cost Data'!D41,C23=10,'Cost Data'!D42,C23=12,'Cost Data'!D43)","v":{"$error":"#N/A"}},{"$f":"IF(E21=\"-P\",D35,0)","v":{"$error":"#N/A"}},{"$f":"IF(F23=\"A.C.\", 126,0)","v":0},{"$f":"_xlfn.IFS(G21=\"-H\",'Cost Data'!D45,G21= \"-S\",'Cost Data'!D46,G21= \"-X\",0)","v":{"$error":"#N/A"}},{"$f":"IF(H21=\"-01\", 'Cost Data'!D19,0)","v":0},{"$f":"_xlfn.IFS(I21=\"-006D\",'Cost Data'!D48,I21=\"-015D\",'Cost Data'!D49,I21=\"-030D\",'Cost Data'!D50,I21=\"-045D\",'Cost Data'!D51,I21=\"-060D\",'Cost Data'!D52,I21=\"-006S\",'Cost Data'!D53,I21=\"-015S\",'Cost Data'!D54,I21=\"-030S\",'Cost Data'!D55,I21=\"-045S\",'Cost Data'!D56,I21=\"-060S\",'Cost Data'!D57,I21=\"-0000\",0)","v":{"$error":"#N/A"}},null,{"$f":"(C35+E35+F35+G35+H35+I35)","v":{"$error":"#N/A"}}]
[null,{"$f":"B33","v":{"$error":"#N/A"}},null,null,null,null,null,null,null,null,null,null,null,{"$f":"_xlfn.TEXTJOIN(\"\",TRUE,C21:E21)","v":{"$error":"#N/A"}}]
[null,{"$f":"_xlfn.IFS(N36=\"-0200-F1-R\",'Cost Data'!B989,N36=\"-0200-F1-P\",'Cost Data'!B997,N36=\"-0300-F1-R\",'Cost Data'!B990,N36=\"-0300-F1-P\",'Cost Data'!B998,N36=\"-0400-F1-R\",'Cost Data'!B991,N36=\"-0400-F1-P\",'Cost Data'!B999,N36=\"-0600-F1-R\",'Cost Data'!B992,N36=\"-0600-F1-P\",'Cost Data'!B1000,N36=\"-0800-F1-R\",'Cost Data'!B993,N36=\"-0800-F1-P\",'Cost Data'!B1001,N36=\"-1000-F1-R\",'Cost Data'!B994,N36=\"-1000-F1-P\",'Cost Data'!B1002,N36=\"-1200-F1-R\",'Cost Data'!B995,N36=\"-1200-F1-P\",'Cost Data'!B1003)","v":{"$error":"#N/A"}},null,null,null,{"$f":"_xlfn.IFS(N36=\"-0200-F1-R\",'Cost Data'!C989,N36=\"-0200-F1-P\",'Cost Data'!C997,N36=\"-0300-F1-R\",'Cost Data'!C990,N36=\"-0300-F1-P\",'Cost Data'!C998,N36=\"-0400-F1-R\",'Cost Data'!C991,N36=\"-0400-F1-P\",'Cost Data'!C999,N36=\"-0600-F1-R\",'Cost Data'!C992,N36=\"-0600-F1-P\",'Cost Data'!C1000,N36=\"-0800-F1-R\",'Cost Data'!C993,N36=\"-0800-F1-P\",'Cost Data'!C1001,N36=\"-1000-F1-R\",'Cost Data'!C994,N36=\"-1000-F1-P\",'Cost Data'!C1002,N36=\"-1200-F1-R\",'Cost Data'!C995,N36=\"-1200-F1-P\",'Cost Data'!C1003)","v":{"$error":"#N/A"}},null,null,null,null,{"$f":"_xlfn.IFS(N36=\"-0200-F1-R\",'Cost Data'!D989,N36=\"-0200-F1-P\",'Cost Data'!D997,N36=\"-0300-F1-R\",'Cost Data'!D990,N36=\"-0300-F1-P\",'Cost Data'!D998,N36=\"-0400-F1-R\",'Cost Data'!D991,N36=\"-0400-F1-P\",'Cost Data'!D999,N36=\"-0600-F1-R\",'Cost Data'!D992,N36=\"-0600-F1-P\",'Cost Data'!D1000,N36=\"-0800-F1-R\",'Cost Data'!D993,N36=\"-0800-F1-P\",'Cost Data'!D1001,N36=\"-1000-F1-R\",'Cost Data'!D994,N36=\"-1000-F1-P\",'Cost Data'!D1002,N36=\"-1200-F1-R\",'Cost Data'!D995,N36=\"-1200-F1-P\",'Cost Data'!D1003)","v":{"$error":"#N/A"}}]
[null,null,null,null,null,null,null,null,null,null,{"$f":"K35+K37","v":{"$error":"#N/A"}}]
[]
[]
[null,"iMAG4700r",{"$f":"_xlfn.IFS(C43=2,\"-0200\",C43=3,\"-0300\",C43=4,\"-0400\",C43=6,\"-0600\",C43=8,\"-0800\",C43=10,\"-1000\",C3=12,\"-1200\")","v":{"$error":"#N/A"}},{"$f":"IF(D43=\"F1\", \"-F1\", 0)","v":"-F1"},{"$f":"_xlfn.IFS(E43=\"NSF\", \"-P\", E43=\"Non-NSF\", \"-R\")","v":{"$error":"#N/A"}},{"$f":"_xlfn.IFS(F43=\"DC_Remote\", \"-D1\", F43=\"AC_Remote\", \"-A1\")","v":{"$error":"#N/A"}},{"$f":"_xlfn.IFS(G43=\"No Optional Output\", \"-X\",G43= \"_4_20mA\", \"-L\",G43= \"Modbus\", \"-S\",G43= \"HART\", \"-H\",G43= \"AC_Modbus\", \"-S\")","v":{"$error":"#N/A"}},{"$f":"IF(H43=\"Yes\", \"-01\", \"-XX\")","v":"-XX"},{"$f":"_xlfn.IFS(I43=\".-006S\",\"-006S\",I43=\".-015S\",\"-015S\",I43=\".-030S\",\"-030S\",I43=\".-045S\",\"-045S\",I43=\".-060S\",\"-060S\",I43=\".-006D\",\"-006D\",I43=\".-015D\",\"-015D\",I43=\".-030D\",\"-030D\",I43=\".-045D\",\"-045D\",I43=\".-060D\",\"-060D\",I43=0,\"-0000\")","v":{"$error":"#N/A"}},{"$f":"_xlfn.IFS(J43=\".-006\", \"-006\",J43=\".-015\", \"-015\",J43= \".-030\", \"-030\",J43= \".-045\", \"-045\",J43= \".-060\", \"-060\")","v":{"$error":"#N/A"}}]
["iMAG4700r (Remote Display)",null,"Size","Style","Gaskets","Power","Optional output (Pulse is standard)","Data Logger","Cables","Remote Cable"]
[null,null,null,"F1",null,null,"Please Select",null,"Please Select"]
[null,null,".-0200 2\"",".-F1",".- X",".-D1 - DC",".-X (Single Cable for DC Power & output)",".-XX None","6m (20ft)","6m (20ft)"]
[null,null,".-0300 3\"",null,".-R Non NSF",null,".-L (Single Cable for DC Power & output)",".-01 Data Logger","15m (50ft)","15m (50ft)"]
[null,null,".-0400 4\"",null,".-P NSF",null,".-H (Single Cable for DC Power & output)",null,"30m (100ft)","30m (100ft)"]
[null,null,".-0600 6\"",null,null,null,".-S (Dual Cable for DC Power & output)",null,"45m (150ft)","45m (150ft)"]
[null,null,".-0800 8\"",null,null,".-A1 - AC",".-X (Single Cable for output)",null,"60m (200ft)","60m (200ft)"]
[null,null,".-1000 10\"",null,null,null,".-L (Single Cable for output)"]
[null,null,".-1200 12\"",null,null,null,".-H (Single Cable for output)"]
[null,null,null,null,null,null,".-S  (Single Cable for output)"]
[]
[null,"REMOTE MODEL"]
[null,{"$f":"_xlfn.TEXTJOIN(\"\",TRUE,B41:J41)","v":{"$error":"#N/A"}}]
[null,null,"Meter ",null,"Gasket","Power","Optional Output","Data Logger","Output Cable","Remote Cable","List Price"]
[null,"Meter",{"$f":"_xlfn.IFS(C43=2, 'Cost Data'!D58,C43=3, 'Cost Data'!D59, C43=4, 'Cost Data'!D60,C43=6, 'Cost Data'!D61,C43=8, 'Cost Data'!D62,C43=10, 'Cost Data'!D63,C43=12, 'Cost Data'!D64)","v":{"$error":"#N/A"}},{"$f":"_xlfn.IFS(C43=2, 'Cost Data'!D65,C43=3, 'Cost Data'!D66, C43=4, 'Cost Data'!D67,C43=6, 'Cost Data'!D68,C43=8, 'Cost Data'!D69,C43=10, 'Cost Data'!D70,C43=12, 'Cost Data'!D71)","v":{"$error":"#N/A"}},{"$f":"IF(E41=\"-P\",D56,0)","v":{"$error":"#N/A"}},{"$f":"IF(F43=\"AC_remote\", 126,0)","v":0},{"$f":"_xlfn.IFS(G41=\"-L\",'Cost Data'!D73,iMAG4700!G41=\"-H\",'Cost Data'!D95,G41= \"-S\",'Cost Data'!D75,G41= \"-X\",0)","v":{"$error":"#N/A"}},{"$f":"IF(H41=\"-01\", 'Cost Data'!D47,0)","v":0},{"$f":"_xlfn.IFS(I41=\"-006D\",'Cost Data'!D77,I41=\"-015D\",'Cost Data'!D78,I41=\"-030D\",'Cost Data'!D79,I41=\"-045D\",'Cost Data'!D80,I41=\"-060D\",'Cost Data'!D81,I41=\"-006S\",'Cost Data'!D82,I41=\"-015S\",'Cost Data'!D83,I41=\"-030S\",'Cost Data'!D84,I41=\"-045S\",'Cost Data'!D85,I41=\"-060S\",'Cost Data'!D86,I41=\"-0000\",0)","v":{"$error":"#N/A"}},{"$f":"_xlfn.IFS(J41=\"-006\",'Cost Data'!D87,J41=\"-015\",'Cost Data'!D88,J41=\"-030\",'Cost Data'!D89,J41=\"-045\",'Cost Data'!D90,J41=\"-060\",'Cost Data'!D91,J41=0,”Must Have Cable”)","v":{"$error":"#N/A"}},{"$f":"(C56+E56+F56+G56+H56+I56+J56)","v":{"$error":"#N/A"}}]
[null,{"$f":"B54","v":{"$error":"#N/A"}},null,null,null,null,null,null,null,null,null,null,null,{"$f":"_xlfn.TEXTJOIN(\"\",TRUE,C41:E41)","v":{"$error":"#N/A"}}]
[null,{"$f":"_xlfn.IFS(N57=\"-0200-F1-R\",'Cost Data'!B989,N57=\"-0200-F1-P\",'Cost Data'!B997,N57=\"-0300-F1-R\",'Cost Data'!B990,N57=\"-0300-F1-P\",'Cost Data'!B998,N57=\"-0400-F1-R\",'Cost Data'!B991,N57=\"-0400-F1-P\",'Cost Data'!B999,N57=\"-0600-F1-R\",'Cost Data'!B992,N57=\"-0600-F1-P\",'Cost Data'!B1000,N57=\"-0800-F1-R\",'Cost Data'!B993,N57=\"-0800-F1-P\",'Cost Data'!B1001,N57=\"-1000-F1-R\",'Cost Data'!B994,N57=\"-1000-F1-P\",'Cost Data'!B1002,N57=\"-1200-F1-R\",'Cost Data'!B995,N57=\"-1200-F1-P\",'Cost Data'!B1003)","v":{"$error":"#N/A"}},null,null,null,{"$f":"_xlfn.IFS(N57=\"-0200-F1-R\",'Cost Data'!C989,N57=\"-0200-F1-P\",'Cost Data'!C997,N57=\"-0300-F1-R\",'Cost Data'!C990,N57=\"-0300-F1-P\",'Cost Data'!C998,N57=\"-0400-F1-R\",'Cost Data'!C991,N57=\"-0400-F1-P\",'Cost Data'!C999,N57=\"-0600-F1-R\",'Cost Data'!C992,N57=\"-0600-F1-P\",'Cost Data'!C1000,N57=\"-0800-F1-R\",'Cost Data'!C993,N57=\"-0800-F1-P\",'Cost Data'!C1001,N57=\"-1000-F1-R\",'Cost Data'!C994,N57=\"-1000-F1-P\",'Cost Data'!C1002,N57=\"-1200-F1-R\",'Cost Data'!C995,N57=\"-1200-F1-P\",'Cost Data'!C1003)","v":{"$error":"#N/A"}},null,null,null,null,{"$f":"_xlfn.IFS(N57=\"-0200-F1-R\",'Cost Data'!D989,N57=\"-0200-F1-P\",'Cost Data'!D997,N57=\"-0300-F1-R\",'Cost Data'!D990,N57=\"-0300-F1-P\",'Cost Data'!D998,N57=\"-0400-F1-R\",'Cost Data'!D991,N57=\"-0400-F1-P\",'Cost Data'!D999,N57=\"-0600-F1-R\",'Cost Data'!D992,N57=\"-0600-F1-P\",'Cost Data'!D1000,N57=\"-0800-F1-R\",'Cost Data'!D993,N57=\"-0800-F1-P\",'Cost Data'!D1001,N57=\"-1000-F1-R\",'Cost Data'!D994,N57=\"-1000-F1-P\",'Cost Data'!D1002,N57=\"-1200-F1-R\",'Cost Data'!D995,N57=\"-1200-F1-P\",'Cost Data'!D1003)","v":{"$error":"#N/A"}}]
[null,null,null,null,null,null,null,null,null,null,{"$f":"K56+K58","v":{"$error":"#N/A"}}]
[]
[]
[null,"iMAG4700 Parts & Accessories"]
[null,"Model #",null,"Description",null,null,null,null,null,null,"Price"]
[null,"104094-006",null,"DC Power/Output or Sensor Cable, 6 Meter (20 ft.), 4 Pin",null,null,null,null,null,null,{"$f":"'Cost Data'!D931","v":107}]
[null,"104094-015",null,"DC Power/Output or Sensor Cable, 15 Meter (50 ft.), 4 Pin",null,null,null,null,null,null,{"$f":"'Cost Data'!D932","v":171}]
[null,"104094-030",null,"DC Power/Output or Sensor Cable, 30 Meter (100 ft.), 4 Pin",null,null,null,null,null,null,{"$f":"'Cost Data'!D933","v":284}]
[null,"104094-045",null,"DC Power/Output or Sensor Cable, 45 Meter (150 ft.), 4 Pin",null,null,null,null,null,null,{"$f":"'Cost Data'!D934","v":404}]
[null,"104094-060",null,"DC Power/Output or Sensor Cable, 60 Meter (200 ft.), 4 Pin",null,null,null,null,null,null,{"$f":"'Cost Data'!D935","v":525}]
[null,"104097-006",null,"DC Power/Output or Sensor Cable, 6 Meter (20 ft.), 8 Pin",null,null,null,null,null,null,{"$f":"'Cost Data'!D936","v":109}]
[null,"104097-015",null,"DC Power/Output or Sensor Cable, 15 Meter (50 ft.), 8 Pin",null,null,null,null,null,null,{"$f":"'Cost Data'!D937","v":196}]
[null,"104097-030",null,"DC Power/Output or Sensor Cable, 30 Meter (100 ft.), 8 Pin",null,null,null,null,null,null,{"$f":"'Cost Data'!D938","v":338}]
[null,"104097-045",null,"DC Power/Output or Sensor Cable, 45 Meter (150 ft.), 8 Pin",null,null,null,null,null,null,{"$f":"'Cost Data'!D939","v":482}]
[null,"104097-060",null,"DC Power/Output or Sensor Cable, 60 Meter (200 ft.), 8 Pin",null,null,null,null,null,null,{"$f":"'Cost Data'!D940","v":625}]
[null,{"$f":"'Cost Data'!B936","v":"103706-006"},null,{"$f":"'Cost Data'!C936","v":"DC Power/Output Cable, 6 Meter (20 ft.), 8 Con"},null,null,null,null,null,null,{"$f":"'Cost Data'!D936","v":109}]
[null,{"$f":"'Cost Data'!B937","v":"103706-015"},null,{"$f":"'Cost Data'!C937","v":"DC Power/Output Cable, 15 Meter (50 ft.), 8 Con"},null,null,null,null,null,null,{"$f":"'Cost Data'!D937","v":196}]
[null,{"$f":"'Cost Data'!B938","v":"103706-030"},null,{"$f":"'Cost Data'!C938","v":"DC Power/Output Cable, 30 Meter (100 ft.), 8 Con"},null,null,null,null,null,null,{"$f":"'Cost Data'!D938","v":338}]
[null,{"$f":"'Cost Data'!B939","v":"103706-045"},null,{"$f":"'Cost Data'!C939","v":"DC Power/Output Cable, 45 Meter (150 ft.), 8 Con"},null,null,null,null,null,null,{"$f":"'Cost Data'!D939","v":482}]
[null,{"$f":"'Cost Data'!B940","v":"103706-060"},null,{"$f":"'Cost Data'!C940","v":"DC Power/Output Cable, 60 Meter (200 ft.), 8 Con"},null,null,null,null,null,null,{"$f":"'Cost Data'!D940","v":625}]
[null,{"$f":"'Cost Data'!B941","v":103701},null,{"$f":"'Cost Data'!C941","v":"AC Power/Output Cable 1.8 Meter (6 ft.), Includes wall outlet plug"},null,null,null,null,null,null,{"$f":"'Cost Data'!D941","v":15}]
[null,{"$f":"'Cost Data'!B942","v":"103149-006"},null,{"$f":"'Cost Data'!C942","v":"AC Power/Output Cable 6 Meter (20 ft.), Cable Only"},null,null,null,null,null,null,{"$f":"'Cost Data'!D942","v":46}]
[null,{"$f":"'Cost Data'!B943","v":"103149-015"},null,{"$f":"'Cost Data'!C943","v":"AC Power/Output Cable 15 Meter (50 ft.), Cable Only"},null,null,null,null,null,null,{"$f":"'Cost Data'!D943","v":114}]
[null,{"$f":"'Cost Data'!B944","v":"103149-030"},null,{"$f":"'Cost Data'!C944","v":"AC Power/Output Cable 30 Meter (100 ft.), Cable Only"},null,null,null,null,null,null,{"$f":"'Cost Data'!D944","v":229}]
[null,{"$f":"'Cost Data'!B945","v":"103149-045"},null,{"$f":"'Cost Data'!C945","v":"AC Power/Output Cable 45 Meter (150 ft.), Cable Only"},null,null,null,null,null,null,{"$f":"'Cost Data'!D945","v":343}]
[null,{"$f":"'Cost Data'!B946","v":"103149-060"},null,{"$f":"'Cost Data'!C946","v":"AC Power/Output Cable 60 Meter (200 ft.), Cable Only"},null,null,null,null,null,null,{"$f":"'Cost Data'!D946","v":459}]
[null,{"$f":"'Cost Data'!B947","v":"104124 (1)"},null,{"$f":"'Cost Data'!C947","v":"Grounding Ring, Magmeter, 2\""},null,null,null,null,null,null,{"$f":"'Cost Data'!D947","v":107}]
[null,{"$f":"'Cost Data'!B948","v":"102157 (1)"},null,{"$f":"'Cost Data'!C948","v":"Grounding Ring, Magmeter, 3\""},null,null,null,null,null,null,{"$f":"'Cost Data'!D948","v":119}]
[null,{"$f":"'Cost Data'!B949","v":"100876 (1)"},null,{"$f":"'Cost Data'!C949","v":"Grounding Ring, Magmeter, 4\""},null,null,null,null,null,null,{"$f":"'Cost Data'!D949","v":126}]
[null,{"$f":"'Cost Data'!B950","v":"100877 (1)"},null,{"$f":"'Cost Data'!C950","v":"Grounding Ring, Magmeter 6\""},null,null,null,null,null,null,{"$f":"'Cost Data'!D950","v":132}]
[null,{"$f":"'Cost Data'!B951","v":"100878 (1)"},null,{"$f":"'Cost Data'!C951","v":"Grounding Ring, Magmeter 8\""},null,null,null,null,null,null,{"$f":"'Cost Data'!D951","v":141}]
[null,{"$f":"'Cost Data'!B952","v":"100879 (1)"},null,{"$f":"'Cost Data'!C952","v":"Grounding Ring, Magmeter 10\""},null,null,null,null,null,null,{"$f":"'Cost Data'!D952","v":198}]
[null,{"$f":"'Cost Data'!B953","v":"103288 (1)"},null,{"$f":"'Cost Data'!C953","v":"Grounding Ring, Magmeter 12\""},null,null,null,null,null,null,{"$f":"'Cost Data'!D953","v":202}]
[null,{"$f":"'Cost Data'!B954","v":"103922-15"},null,{"$f":"'Cost Data'!C954","v":"15-Pin Connector Kit"},null,null,null,null,null,null,{"$f":"'Cost Data'!D954","v":38}]
[null,{"$f":"'Cost Data'!B955","v":103971},null,{"$f":"'Cost Data'!C955","v":"Battery Replacement Kit, (2) D-Cell"},null,null,null,null,null,null,{"$f":"'Cost Data'!D955","v":126}]
[null,{"$f":"'Cost Data'!B956","v":103500},null,{"$f":"'Cost Data'!C956","v":"Security Seal, Plastic Padlock"},null,null,null,null,null,null,{"$f":"'Cost Data'!D956","v":2}]
[null,{"$f":"'Cost Data'!B957","v":100854},null,{"$f":"'Cost Data'!C957","v":"Wire, for Security Seal, 12\" (For 3\" Only)"},null,null,null,null,null,null,{"$f":"'Cost Data'!D957","v":3}]
[null,{"$f":"'Cost Data'!B958","v":104073},null,{"$f":"'Cost Data'!C958","v":"Security Tab"},null,null,null,null,null,null,{"$f":"'Cost Data'!D958","v":2}]
[null,{"$f":"'Cost Data'!B959","v":"103490-01"},null,{"$f":"'Cost Data'!C959","v":"Display Cover, White"},null,null,null,null,null,null,{"$f":"'Cost Data'!D959","v":14}]
[null,{"$f":"'Cost Data'!B960","v":"103709-01"},null,{"$f":"'Cost Data'!C960","v":"Display Cover Kit, with Lanyard & Split Key Ring"},null,null,null,null,null,null,{"$f":"'Cost Data'!D960","v":36}]
[null,{"$f":"'Cost Data'!B961","v":103984},null,{"$f":"'Cost Data'!C961","v":"Hinged Display Cover Kit"},null,null,null,null,null,null,{"$f":"'Cost Data'!D961","v":36}]
[null,{"$f":"'Cost Data'!B962","v":103166},null,{"$f":"'Cost Data'!C962","v":"Housing Plug, Black, Qty 1 (includes O-Ring)"},null,null,null,null,null,null,{"$f":"'Cost Data'!D962","v":7}]
[null,{"$f":"'Cost Data'!B963","v":"103028-01"},null,{"$f":"'Cost Data'!C963","v":"Cable Strain Relief, Qty 1 (Includes O-Ring)"},null,null,null,null,null,null,{"$f":"'Cost Data'!D963","v":12}]
[null,{"$f":"'Cost Data'!B964","v":"103038-03-245"},null,{"$f":"'Cost Data'!C964","v":"O-Ring, EPDM, Display Housing"},null,null,null,null,null,null,{"$f":"'Cost Data'!D964","v":8}]
[null,{"$f":"'Cost Data'!B965","v":"103105-04-05"},null,{"$f":"'Cost Data'!C965","v":"O-Ring, EPDM 80 Duro"},null,null,null,null,null,null,{"$f":"'Cost Data'!D965","v":2}]
[null,{"$f":"'Cost Data'!B966","v":"103517-02"},null,{"$f":"'Cost Data'!C966","v":"Data Logger Connector (For base models prior 8/2017, DC4 USB required)"},null,null,null,null,null,null,{"$f":"'Cost Data'!D966","v":87}]
[null,{"$f":"'Cost Data'!B967","v":"103951-02"},null,{"$f":"'Cost Data'!C967","v":"Data Logger Connector (For base models after 8/2017, DC4 USB required)"},null,null,null,null,null,null,{"$f":"'Cost Data'!D967","v":87}]
[null,{"$f":"'Cost Data'!B968","v":"103517-01"},null,{"$f":"'Cost Data'!C968","v":"Data Logger Connector (For all \"p\" and \"r\" models, DC4 USB required)"},null,null,null,null,null,null,{"$f":"'Cost Data'!D968","v":87}]
[null,{"$f":"'Cost Data'!B969","v":"DC4-USB"},null,{"$f":"'Cost Data'!C969","v":"Data Logger Download Cable, IP68"},null,null,null,null,null,null,{"$f":"'Cost Data'!D969","v":207}]
[null,{"$f":"'Cost Data'!B970","v":"DC5-USB"},null,{"$f":"'Cost Data'!C970","v":"Data Logger Download Cable, IP68"},null,null,null,null,null,null,{"$f":"'Cost Data'!D970","v":200}]
[null,{"$f":"'Cost Data'!B971","v":102009},null,{"$f":"'Cost Data'!C971","v":"Data Logger Connector Cap"},null,null,null,null,null,null,{"$f":"'Cost Data'!D971","v":23}]
[null,"iMAG4700 Gasket Kits , (Includes Two Gaskets)"]
[null,"Model #",null,"Description",null,null,null,null,null,null,"Price"]
[null,{"$f":"'Cost Data'!B973","v":"104035-02"},null,{"$f":"'Cost Data'!C973","v":"Gasket Kit, Flanged Magmeter, 2\""},null,null,null,null,null,null,{"$f":"'Cost Data'!D973","v":16}]
[null,{"$f":"'Cost Data'!B974","v":"104035-03"},null,{"$f":"'Cost Data'!C974","v":"Gasket Kit, Flanged Magmeter, 3\""},null,null,null,null,null,null,{"$f":"'Cost Data'!D974","v":19}]
[null,{"$f":"'Cost Data'!B975","v":"104035-04"},null,{"$f":"'Cost Data'!C975","v":"Gasket Kit, Flanged Magmeter, 4\""},null,null,null,null,null,null,{"$f":"'Cost Data'!D975","v":20}]
[null,{"$f":"'Cost Data'!B976","v":"104035-06"},null,{"$f":"'Cost Data'!C976","v":"Gasket Kit, Flanged Magmeter, 6\""},null,null,null,null,null,null,{"$f":"'Cost Data'!D976","v":25}]
[null,{"$f":"'Cost Data'!B977","v":"104035-08"},null,{"$f":"'Cost Data'!C977","v":"Gasket Kit, Flanged Magmeter, 8\""},null,null,null,null,null,null,{"$f":"'Cost Data'!D977","v":30}]
[null,{"$f":"'Cost Data'!B978","v":"104035-10"},null,{"$f":"'Cost Data'!C978","v":"Gasket Kit, Flanged Magmeter, 10\""},null,null,null,null,null,null,{"$f":"'Cost Data'!D978","v":41}]
[null,{"$f":"'Cost Data'!B979","v":"104035-12"},null,{"$f":"'Cost Data'!C979","v":"Gasket Kit, Flanged Magmeter, 12\""},null,null,null,null,null,null,{"$f":"'Cost Data'!D979","v":48}]
[null,"iMAG4700 Gasket Kits , NSF (Includes Two Gaskets)"]
[null,"Model #",null,"Description",null,null,null,null,null,null,"Price"]
[null,{"$f":"'Cost Data'!B981","v":"104036-02"},null,{"$f":"'Cost Data'!C981","v":"Gasket Kit, Flanged Magmeter, NSF, 2\""},null,null,null,null,null,null,{"$f":"'Cost Data'!D981","v":36}]
[null,{"$f":"'Cost Data'!B982","v":"104036-03"},null,{"$f":"'Cost Data'!C982","v":"Gasket Kit, Flanged Magmeter, NSF, 3\""},null,null,null,null,null,null,{"$f":"'Cost Data'!D982","v":48}]
[null,{"$f":"'Cost Data'!B983","v":"104036-04"},null,{"$f":"'Cost Data'!C983","v":"Gasket Kit, Flanged Magmeter, NSF, 4\""},null,null,null,null,null,null,{"$f":"'Cost Data'!D983","v":66}]
[null,{"$f":"'Cost Data'!B984","v":"104036-06"},null,{"$f":"'Cost Data'!C984","v":"Gasket Kit, Flanged Magmeter, NSF, 6\""},null,null,null,null,null,null,{"$f":"'Cost Data'!D984","v":95}]
[null,{"$f":"'Cost Data'!B985","v":"104036-08"},null,{"$f":"'Cost Data'!C985","v":"Gasket Kit, Flanged Magmeter, NSF, 8\""},null,null,null,null,null,null,{"$f":"'Cost Data'!D985","v":139}]
[null,{"$f":"'Cost Data'!B986","v":"104036-10"},null,{"$f":"'Cost Data'!C986","v":"Gasket Kit, Flanged Magmeter, NSF, 10\""},null,null,null,null,null,null,{"$f":"'Cost Data'!D986","v":183}]
[null,{"$f":"'Cost Data'!B987","v":"104036-12"},null,{"$f":"'Cost Data'!C987","v":"Gasket Kit, Flanged Magmeter, NSF, 12\""},null,null,null,null,null,null,{"$f":"'Cost Data'!D987","v":275}]
[null,"iMAG4700 Grounding Ring & Gasket Kits , (Includes Two Grounding Rings and Two Gaskets)"]
[null,"Model #",null,"Description",null,null,null,null,null,null,"Price"]
[null,{"$f":"'Cost Data'!B989","v":"104039-02"},null,{"$f":"'Cost Data'!C989","v":"Grounding Ring/Gasket Kit, Flanged Magmeter, 2\""},null,null,null,null,null,null,{"$f":"'Cost Data'!D989","v":245}]
[null,{"$f":"'Cost Data'!B990","v":"104039-03"},null,{"$f":"'Cost Data'!C990","v":"Grounding Ring/Gasket Kit, Flanged Magmeter, 3\""},null,null,null,null,null,null,{"$f":"'Cost Data'!D990","v":258}]
[null,{"$f":"'Cost Data'!B991","v":"104039-04"},null,{"$f":"'Cost Data'!C991","v":"Grounding Ring/Gasket Kit, Flanged Magmeter, 4\""},null,null,null,null,null,null,{"$f":"'Cost Data'!D991","v":273}]
[null,{"$f":"'Cost Data'!B992","v":"104039-06"},null,{"$f":"'Cost Data'!C992","v":"Grounding Ring/Gasket Kit, Flanged Magmeter, 6\""},null,null,null,null,null,null,{"$f":"'Cost Data'!D992","v":292}]
[null,{"$f":"'Cost Data'!B993","v":"104039-08"},null,{"$f":"'Cost Data'!C993","v":"Grounding Ring/Gasket Kit, Flanged Magmeter, 8\""},null,null,null,null,null,null,{"$f":"'Cost Data'!D993","v":311}]
[null,{"$f":"'Cost Data'!B994","v":"104039-10"},null,{"$f":"'Cost Data'!C994","v":"Grounding Ring/Gasket Kit, Flanged Magmeter, 10\""},null,null,null,null,null,null,{"$f":"'Cost Data'!D994","v":435}]
[null,{"$f":"'Cost Data'!B995","v":"104039-12"},null,{"$f":"'Cost Data'!C995","v":"Grounding Ring/Gasket Kit, Flanged Magmeter, 12\""},null,null,null,null,null,null,{"$f":"'Cost Data'!D995","v":449}]
[null,"iMAG4700 Grounding Ring & Gasket Kits , NSF (Includes Two Grounding Rings and Two Gaskets)"]
[null,"Model #",null,"Description",null,null,null,null,null,null,"Price"]
[null,{"$f":"'Cost Data'!B997","v":"104040-02"},null,{"$f":"'Cost Data'!C997","v":"Grounding Ring/Gasket Kit, Flanged Magmeter, NSF, 2\""},null,null,null,null,null,null,{"$f":"'Cost Data'!D997","v":257}]
[null,{"$f":"'Cost Data'!B998","v":"104040-03"},null,{"$f":"'Cost Data'!C998","v":"Grounding Ring/Gasket Kit, Flanged Magmeter, NSF, 3\""},null,null,null,null,null,null,{"$f":"'Cost Data'!D998","v":287}]
[null,{"$f":"'Cost Data'!B999","v":"104040-04"},null,{"$f":"'Cost Data'!C999","v":"Grounding Ring/Gasket Kit, Flanged Magmeter, NSF, 4\""},null,null,null,null,null,null,{"$f":"'Cost Data'!D999","v":319}]
[null,{"$f":"'Cost Data'!B1000","v":"104040-06"},null,{"$f":"'Cost Data'!C1000","v":"Grounding Ring/Gasket Kit, Flanged Magmeter, NSF, 6\""},null,null,null,null,null,null,{"$f":"'Cost Data'!D1000","v":361}]
[null,{"$f":"'Cost Data'!B1001","v":"104040-08"},null,{"$f":"'Cost Data'!C1001","v":"Grounding Ring/Gasket Kit, Flanged Magmeter, NSF, 8\""},null,null,null,null,null,null,{"$f":"'Cost Data'!D1001","v":418}]
[null,{"$f":"'Cost Data'!B1002","v":"104040-10"},null,{"$f":"'Cost Data'!C1002","v":"Grounding Ring/Gasket Kit, Flanged Magmeter, NSF, 10\""},null,null,null,null,null,null,{"$f":"'Cost Data'!D1002","v":579}]
[null,{"$f":"'Cost Data'!B1003","v":"104040-12"},null,{"$f":"'Cost Data'!C1003","v":"Grounding Ring/Gasket Kit, Flanged Magmeter, NSF, 12\""},null,null,null,null,null,null,{"$f":"'Cost Data'!D1003","v":677}]

{"sheet":"WMP","index":8,"n_rows":40,"n_cols":12,"rows_kept":40,"cut":false,"hidden":false,"merged":[[3,8,3,9],[2,8,2,9],[12,9,13,9],[14,9,15,9],[0,4,0,5],[0,8,0,9],[0,6,0,7],[1,8,1,9],[2,4,2,5],[1,4,1,5],[1,6,1,7],[3,6,3,7],[2,6,2,7],[27,4,27,5],[28,4,28,5],[26,4,26,5],[22,1,22,3],[3,4,3,5],[3,3,4,3],[5,2,6,2],[7,2,8,2],[9,2,10,2],[9,3,10,3],[36,2,36,7],[25,1,28,1],[7,3,8,3],[5,3,6,3],[39,2,39,7],[37,2,37,7],[38,2,38,7],[32,1,32,9],[33,2,33,7],[34,2,34,7],[35,2,35,7],[29,8,29,9],[28,8,28,9],[25,8,25,9],[23,1,23,3],[25,4,25,5]]}
[null,{"$f":"B2","v":{"$error":"#N/A"}},{"$f":"C2","v":{"$error":"#N/A"}},null,{"$f":"E2","v":{"$error":"#N/A"}},null,{"$f":"G2","v":{"$error":"#N/A"}},null,{"$f":"IF(I2=0,\"\",I2)","v":{"$error":"#N/A"}},null,{"$f":"_xlfn.IFS(D4=\"Tamper-evident seal, screws, and wire\",-32,D4=\"Extended Battery Life\",-133,D4=\"BSP fittings\",-93,D4=0,0,D4=\"No Fitting Kit (Deduct Price)\",-96,D4=\" \",0)","v":0},{"$f":"IF(K1=0,\"\",K1)","v":""}]
[null,{"$f":"_xlfn.IFS(B4=\"WMP_101\",\"WMP101\",B4=\"WMP_104\",\"WMP104\")","v":{"$error":"#N/A"}},{"$f":"_xlfn.IFS(C4=\"1 inch= -100\", -100,C4=\"2 inch= -200\", -200,C4=\"3 inch= -300\", -300)","v":{"$error":"#N/A"}},{"$f":"_xlfn.TEXTJOIN(\"\",TRUE,L1,L2,L4,L6)","v":""},{"$f":"_xlfn.IFS(E4=\"Gal/Min = GPM\", \"-GPM\",E4=\"Liters/Sec = LPS\", \"-LPS\",E4=\"Liter/Min = -LPM\", \"LPM\",E4=\"Cu Ft/Sec = CFS\", \"-CFS\",E4=\"Cu Ft/Min = CFM\", \"-CFM\",E4=\"Cu Met Min/Min = -CMM\", \"CMM\",E4=\"Cu Met/Hr = CMH\", \"-CMH\",E4=\"Mil Gal/Day = MGD\", \"-MGD\",E4=\"Mil Lt/Day = MLD\", \"-MLD\" )","v":{"$error":"#N/A"}},null,{"$f":"_xlfn.IFS(G4=\"Gal = G\", \"/G\",G4=\"Gal x 1000 = GT\", \"/GT\",G4=\"Cubic Feet = CF\", \"/CF\",G4=\"Acre Inch = AI\", \"/AI\",G4=\"Acre Feet = AF\", \"/AF\",G4=\"Liter = L\", \"/L\",G4=\"Mega Liters = ML\", \"/ML\",G4=\"Cubic Meters = CM\", \"/CM\",G4=\"Cu Met x 1000 = CMT\", \"/CMT\" )","v":{"$error":"#N/A"}},null,{"$f":"_xlfn.IFS((B2&I4=\"WMP101High Frequency = -HF\"),\"-HF\",(B2&I4=\"WMP1011 Units/Pulse = -PxU\"),\"-PxU\",B2=\"WMP104\",0)","v":{"$error":"#N/A"}},null,{"$f":"_xlfn.IFS(D4=\"Tamper-evident seal, screws, and wire\",-32,D4=\"Extended Battery Life\",-133,D4=\"BSP fittings\",-93,D4=0,0,D4=\"No Fitting Kit (Deduct Price)\",-96,D4=\" \",0)","v":0},{"$f":"IF(K2=0,\"\",K2)","v":""}]
[null,"Model","Size","Options","Units Rate",null,"Units Total",null,"Pulse Rate",null,"Option 1"]
[null,null,"Please Select",null,"Please Select",null,"Please Select",null,"Please Select",null,{"$f":"_xlfn.IFS(D6=\"Tamper-evident seal, screws, and wire\",-32,D6=\"Extended Battery Life\",-133,D6=\"BSP fittings\",-93,D6=0,0,D6=\"No Fitting Kit (Deduct Price)\",-96,D6=\" \",0)","v":0},{"$f":"IF(K4=0,\"\",K4)","v":""}]
[null,null,"Option 1",null,null,null,null,null,null,null,"Option 2"]
[null,null,"Option 2",null,null,null,null,null,null,null,{"$f":"_xlfn.IFS(D8=\"Tamper-evident seal, screws, and wire\",-32,D8=\"Extended Battery Life\",-133,D8=\"BSP fittings\",-93,D8=0,0,D8=\"No Fitting Kit (Deduct Price)\",-96,D8=\" \",0)","v":0},{"$f":"IF(K8=0,\"\",K8)","v":""}]
[null,null,null,null,null,null,null,null,null,null,"Option 3"]
[null,null,"Option 3",null,null,null,null,null,null,null,{"$f":"_xlfn.IFS(D10=\"Tamper-evident seal, screws, and wire\",-32,D10=\"Extended Battery Life\",-133,D10=\"BSP fittings\",-93,D10=0,0,D10=\"No Fitting Kit (Deduct Price)\",-96,D10=\" \",0)","v":0}]
[null,null,null,null,null,null,null,null,null,null,"Option 4"]
[null,null,"Option 4"]
[]
[]
[null,"External Power = WMP101","1\" = -100","Tamper-evident seal, ","Gal/Min = GPM ",".= GPM","Gal = G",".= G","High Frequency = -HF",".= HF"]
[null,null,null,"screws, and wire  = -32","Liters/Sec = LPS",".= LPS","Gal x 1000 = GT",".= GT","(WMP101 Only)"]
[null,"Battery Power = WMP104","2\" = -200","Extended Battery Life = -133 ","Liter/Min = LPM ",".= LPM","Cubic Feet = CF",".= CF","1 Units/Pulse = -PxU",".= PxU"]
[null,null,null,"(WMP104 Only)","Cu Ft/Sec = CFS",".= CFS","Acre Inch = AI",".= AI","(WMP101 Only)"]
[null,null,"3\" = -300","*High frequency output = -HF ","Cu Ft/Min = CFM ",".= CFM","Acre Feet = AF",".= AF"]
[null,null,null,"(WMP101 Only)","Cu Met/Min = CMM",".= CMM","Liter = L",".= L"]
[null,null,null,"BSP fittings = -93","Cu Met/Hr = CMH",".= CMH","Mega Liters = ML",".= ML"]
[null,null,null,{"$f":"IF(C2<>100,\"No Fitting Kit (Deduct Price) = -96\",\" \")","v":{"$error":"#N/A"}},"Mil Gal/Day = MGD",".= MGD","Cubic Meters = CM",".= CM"]
[null,null,null,null,"Mil Lt/Day = MLD",".= MLD","Cu Met x 1000 = CMT",".= CMT"]
[]
[null,"Meter P/N"]
[null,{"$f":"_xlfn.TEXTJOIN(\"\",TRUE,B1,C1,L1,L2,L4,L6,E1,G1,I1)","v":{"$error":"#N/A"}}]
[null,null,null,"Options"]
[null,null,null,{"$f":"_xlfn.IFS(K4=-32,'Cost Data'!D105, K4=-93,0,(K4+C2=-296),'Cost Data'!D107, (K4+C2=-396),'Cost Data'!D108, K4=-133,'Cost Data'!D109,K4=0,0)","v":{"$error":"#N/A"}},"Option 1",null,null,null,""]
[null,null,null,{"$f":"_xlfn.IFS(K4=-32,'Cost Data'!D105, K4=-93,0,(K4+C2=-296),'Cost Data'!D107, (K4+C2=-396),'Cost Data'!D108, K4=-133,'Cost Data'!D109,K4=0,0)","v":{"$error":"#N/A"}},"Option 2"]
[null,null,null,{"$f":"_xlfn.IFS(K4=-32,'Cost Data'!D105, K4=-93,0,(K4+C2=-296),'Cost Data'!D107, (K4+C2=-396),'Cost Data'!D108, K4=-133,'Cost Data'!D109,K4=0,0)","v":{"$error":"#N/A"}},"Option 3"]
[null,null,"Meter",{"$f":"_xlfn.IFS(K4=-32,'Cost Data'!D105, K4=-93,0,(K4+C2=-296),'Cost Data'!D107, (K4+C2=-396),'Cost Data'!D108, K4=-133,'Cost Data'!D109,K4=0,0)","v":{"$error":"#N/A"}},"Option 4"]
[null,"Meter",{"$f":"_xlfn.IFS((B2& C2=\"WMP101-100\"),'Cost Data'!D99,(B2& C2=\"WMP101-200\"),'Cost Data'!D100,(B2& C2=\"WMP101-300\"),'Cost Data'!D101,(B2& C2=\"WMP104-100\"),'Cost Data'!D102,(B2& C2=\"WMP104-200\"),'Cost Data'!D103,(B2& C2=\"WMP104-300\"),'Cost Data'!D104)","v":{"$error":"#N/A"}},{"$f":"SUM(D26:D29)","v":{"$error":"#N/A"}},null,null,null,"Total",{"$f":"SUM(C30:D30)","v":{"$error":"#N/A"}}]
[]
[]
[null,"Accessories"]
[null,"FT430W","Remote Rate and Total Indicator (DC powered) = FT430W (-HF Option Required, WMP101 Only)",null,null,null,null,null,{"$f":"IF(B2=\"WMP101\",'Cost Data'!D114,0)","v":{"$error":"#N/A"}}]
[null,"FT440W","Remote Rate and Total Indicator (Loop powered) = FT440W (-HF Option Required, WMP101 Only)",null,null,null,null,null,{"$f":"IF(B2=\"WMP101\",'Cost Data'!D115,0)","v":{"$error":"#N/A"}}]
[null,"DL76W","Remote Data Logger = DL76W (WMP101 Only)",null,null,null,null,null,{"$f":"IF(B2=\"WMP101\",'Cost Data'!D116,0)","v":{"$error":"#N/A"}}]
[null,101222,"2” Fitting Kit, FNPT Flange Clamps = 101222 ",null,null,null,null,null,{"$f":"IF(C2=200,'Cost Data'!D110,0)","v":{"$error":"#N/A"}}]
[null,102203,"2” Fitting Kit, BSP Flange Clamps = 102203",null,null,null,null,null,{"$f":"IF(C2=200,'Cost Data'!D111,0)","v":{"$error":"#N/A"}}]
[null,102073,"3” Fitting Kit, FNPT Flange Clamps = 102073 ",null,null,null,null,null,{"$f":"IF(C2=300,'Cost Data'!D112,0)","v":{"$error":"#N/A"}}]
[null,102204,"3” Fitting Kit, BSP Flange Clamps = 102204",null,null,null,null,null,{"$f":"IF(C2=300,'Cost Data'!D112,0)","v":{"$error":"#N/A"}}]

{"sheet":"PE202","index":9,"n_rows":25,"n_cols":5,"rows_kept":25,"cut":false,"hidden":false,"merged":[[8,5,8,6],[10,1,10,4],[0,5,0,6],[1,0,7,0],[1,5,1,6],[2,5,2,6],[3,5,3,6],[4,5,4,6],[5,5,5,6],[6,5,6,6],[7,5,7,6]]}
[null,"PE202",{"$f":"_xlfn.IFS(C3=\"3/4 in\",\"075\",C3=\"3/8 in\",\"038\")","v":{"$error":"#N/A"}},{"$f":"_xlfn.IFS(D3=\"\",\" \",D3=D4,138,D3=D5,400)","v":" "}]
["PE202",null,"Size","Accessories"]
[]
[null,null,"3/4\" = -075","5.5' embedded cable = -138"]
[null,null,"3/8\" = -038","High Resolution Output - pulse only = -400"]
[]
[]
[]
[]
[]
[null,{"$f":"_xlfn.TEXTJOIN(\"-\",TRUE,B1:D1)","v":{"$error":"#N/A"}}]
[null,null,"Meter ","Accessories","List Price"]
[null,"Meter",{"$f":"_xlfn.IFS(C1=\"038\",'Cost Data'!D635,C1=\"075\",'Cost Data'!D636)","v":{"$error":"#N/A"}},{"$f":"_xlfn.IFS(D1=\" \",0,D1=400,'Cost Data'!D637,D1=138,'Cost Data'!D638)","v":0},{"$f":"SUM(C13:D13)","v":{"$error":"#N/A"}}]
[null,null,"PE202 Parts & Accessories"]
[null,null,"Model #","Description","Price"]
[null,null,103411,"PE202 PVDF Adapter Kit 1/2\" FNPT ",{"$f":"'Cost Data'!D640","v":48}]
[null,null,103412,"PE202 PVDF Adapter Kit 1/4\" MNPT ",{"$f":"'Cost Data'!D641","v":225}]
[null,null,103413,"PE202 PP Adapter Kit 1/4\" MNPT ",{"$f":"'Cost Data'!D642","v":117}]
[null,null,103414,"PE202 PVDF Adapter Kit 3/8\" MNPT ",{"$f":"'Cost Data'!D643","v":225}]
[null,null,103415,"PE202 PP Adapter Kit 3/8\" MNPT ",{"$f":"'Cost Data'!D644","v":117}]
[null,null,103416,"PE202 PVDF Adapter Kit 1/2\" MNPT ",{"$f":"'Cost Data'!D645","v":225}]
[null,null,103417,"PE202 PP Adapter Kit 1/2\" MNPT ",{"$f":"'Cost Data'!D646","v":117}]
[null,null,103418,"PE202 PVDF Adapter Kit 3/4\" MNPT ",{"$f":"'Cost Data'!D647","v":225}]
[null,null,103419,"PE202 PP Adapter Kit 3/4\" MNPT ",{"$f":"'Cost Data'!D648","v":117}]
[null,null,101422,"PE Output Cable, 6 Meter, 8 Conductor, Shielded, Female ",{"$f":"'Cost Data'!D649","v":89}]

{"sheet":"FT 400 Series","index":10,"n_rows":54,"n_cols":8,"rows_kept":54,"cut":false,"hidden":false,"merged":[[92,0,92,1],[92,2,92,5],[93,0,93,1],[93,2,93,5],[13,0,18,0],[19,0,24,0],[25,0,30,0],[16,4,18,4],[13,4,15,4],[19,4,21,4],[22,4,24,4],[25,4,30,4],[26,2,26,3],[27,2,27,3],[20,2,20,3],[21,2,21,3],[31,2,31,3],[25,2,25,3],[28,2,28,3],[29,2,29,3],[30,2,30,3],[89,0,89,1],[89,2,89,5],[90,0,90,1],[97,0,97,1],[97,2,97,5],[98,0,98,1],[98,2,98,5],[99,0,99,1],[99,2,99,5],[94,0,94,1],[94,2,94,5],[95,0,95,1],[95,2,95,5],[96,0,96,1],[96,2,96,5],[90,2,90,5],[91,0,91,1],[91,2,91,5],[86,0,86,1],[86,2,86,5],[87,0,87,1],[87,2,87,5],[88,0,88,1],[88,2,88,5],[83,0,83,1],[83,2,83,5],[84,0,84,1],[84,2,84,5],[85,0,85,1],[85,2,85,5],[79,2,79,5],[80,0,80,1],[80,2,80,5],[81,0,81,1],[81,2,81,5],[82,0,82,1],[82,2,82,5],[79,0,79,1],[75,0,75,1],[75,2,75,5],[76,2,76,5],[77,0,77,1],[77,2,77,5],[78,0,78,1],[78,2,78,5],[76,0,76,1],[71,0,71,1],[71,2,71,5],[72,0,72,1],[72,2,72,5],[73,2,73,5],[74,0,74,1],[74,2,74,5],[73,0,73,1],[67,0,67,1],[67,2,67,5],[68,2,68,5],[69,0,69,1],[69,2,69,5],[70,0,70,1],[70,2,70,5],[68,0,68,1],[64,0,64,1],[64,2,64,5],[65,0,65,1],[65,2,65,5],[66,0,66,1],[66,2,66,5],[61,0,61,1],[61,2,61,5],[62,0,62,1],[62,2,62,5],[63,0,63,1],[63,2,63,5],[57,0,57,1],[57,2,57,5],[58,2,58,5],[59,0,59,1],[59,2,59,5],[60,0,60,1],[60,2,60,5],[58,0,58,1],[54,0,54,1],[54,2,54,5],[55,0,55,1],[55,2,55,5],[56,0,56,1],[56,2,56,5],[51,0,51,1],[51,2,51,5],[52,0,52,1],[52,2,52,5],[53,0,53,1],[53,2,53,5],[49,0,49,1],[49,2,49,5],[50,0,50,1],[50,2,50,5],[45,0,45,1],[45,2,45,5],[46,0,46,1],[46,2,46,5],[47,0,47,1],[47,2,47,5],[44,0,44,1],[44,2,44,5],[39,0,39,1],[39,2,39,5],[40,0,40,1],[40,2,40,5],[41,0,41,1],[41,2,41,5],[48,0,48,1],[48,2,48,5],[38,0,38,1],[38,2,38,5],[34,0,34,1],[34,2,34,5],[35,2,35,5],[35,0,35,1],[42,0,42,1],[42,2,42,5],[43,0,43,1],[43,2,43,5],[1,2,1,5],[13,1,18,1],[19,1,24,1],[11,0,11,1],[11,2,11,3],[36,0,36,1],[36,2,36,5],[37,0,37,1],[37,2,37,5],[12,2,12,3],[13,2,13,3],[14,2,14,3],[15,2,15,3],[18,2,18,3],[19,2,19,3],[25,1,30,1],[22,2,22,3],[23,2,23,3],[24,2,24,3]]}
[]
[{"$f":"_xlfn.TEXTJOIN(\"\",TRUE,B12,C12)","v":""},{"$f":"_xlfn.TEXTJOIN(\"\",TRUE,C12,E12)","v":"Please Select"},{"$f":"F12","v":""},null,null,null,{"$f":"_xlfn.TEXTJOIN(\"-\",TRUE,B2,C2)","v":"Please Select"}]
[null,"Meter","Options"]
["Costs",{"$f":"_xlfn.IFS(B2=\"FT430W\",'Cost Data'!D1004,B2=\"FT430P\",'Cost Data'!D1005,B2=\"FT440W\",'Cost Data'!D1006,B2=\"FT440P\",'Cost Data'!D1007,B2=\"FT450W\",'Cost Data'!D1008)","v":{"$error":"#N/A"}},{"$f":"SUM(D6:D11)","v":0},null,null,null,{"$f":"B4+C4","v":{"$error":"#N/A"}}]
[null,null,null,null,null,null,"Available Options"]
[null,null,null,{"$f":"_xlfn.IFS(F6=\"\",0,F6=F14,'Cost Data'!D1009,F6=F15,'Cost Data'!D1010,F6=F16,'Cost Data'!D1011,F6=F17,'Cost Data'!D1012,F6=F18,'Cost Data'!D1013,F6=F19,'Cost Data'!D1014,F6=F20,'Cost Data'!D1009,F6=F21,'Cost Data'!D1010,F6=F22,'Cost Data'!D1011,F6=F23,'Cost Data'!D1012,F6=F24,'Cost Data'!D1013,F6=F25,'Cost Data'!D1014,F6=F26,'Cost Data'!D1009,F6=F27,'Cost Data'!D1010,F6=F28,'Cost Data'!D1012)","v":0},"Option 1",null,{"$f":"_xlfn.IFS(B2=\"FT430W\",F14,B2=\"FT430P\",F15,B2=\"FT440W\",F20,B2=\"FT440P\",F21,B2=\"FT450W\",F26,B2=\"Please Select\",\"\",B2=\"\",\"\")","v":""},{"$f":"_xlfn.IFS(F6=\"\",\"\",F6=F14,\"32\",F6=F15,\"64\",F6=F16,\"98\",F6=F17,\"126\",F6=F18,\"139\",F6=F19,\"140\",F6=F20,\"32\",F6=F21,\"64\",F6=F22,\"98\",F6=F23,\"126\",F6=F24,\"139\",F6=F25,\"140\",F6=F26,\"32\",F6=F27,\"64\",F6=F28,\"126\")","v":""}]
[null,null,null,{"$f":"_xlfn.IFS(F7=\"\",0,F7=F14,'Cost Data'!D1009,F7=F15,'Cost Data'!D1010,F7=F16,'Cost Data'!D1011,F7=F17,'Cost Data'!D1012,F7=F18,'Cost Data'!D1013,F7=F19,'Cost Data'!D1014,F7=F20,'Cost Data'!D1009,F7=F21,'Cost Data'!D1010,F7=F22,'Cost Data'!D1011,F7=F23,'Cost Data'!D1012,F7=F24,'Cost Data'!D1013,F7=F25,'Cost Data'!D1014,F7=F26,'Cost Data'!D1009,F7=F27,'Cost Data'!D1010,F7=F28,'Cost Data'!D1012)","v":0},"Option 2",null,{"$f":"_xlfn.IFS(B2=\"FT430W\",F15,B2=\"FT430P\",F16,B2=\"FT440W\",F21,B2=\"FT440P\",F22,B2=\"FT450W\",F27,B2=\"Please Select\",\"\",B2=\"\",\"\")","v":""},{"$f":"_xlfn.IFS(F7=\"\",\"\",F7=F14,\"32\",F7=F15,\"64\",F7=F16,\"98\",F7=F17,\"126\",F7=F18,\"139\",F7=F19,\"140\",F7=F20,\"32\",F7=F21,\"64\",F7=F22,\"98\",F7=F23,\"126\",F7=F24,\"139\",F7=F25,\"140\",F7=F26,\"32\",F7=F27,\"64\",F7=F28,\"126\")","v":""}]
[null,null,null,{"$f":"_xlfn.IFS(F8=\"\",0,F8=F14,'Cost Data'!D1009,F8=F15,'Cost Data'!D1010,F8=F16,'Cost Data'!D1011,F8=F17,'Cost Data'!D1012,F8=F18,'Cost Data'!D1013,F8=F19,'Cost Data'!D1014,F8=F20,'Cost Data'!D1009,F8=F21,'Cost Data'!D1010,F8=F22,'Cost Data'!D1011,F8=F23,'Cost Data'!D1012,F8=F24,'Cost Data'!D1013,F8=F25,'Cost Data'!D1014,F8=F26,'Cost Data'!D1009,F8=F27,'Cost Data'!D1010,F8=F28,'Cost Data'!D1012)","v":0},"Option 3",null,{"$f":"_xlfn.IFS(B2=\"FT430W\",F16,B2=\"FT430P\",F17,B2=\"FT440W\",F22,B2=\"FT440P\",F23,B2=\"FT450W\",F28,B2=\"Please Select\",\"\",B2=\"\",\"\")","v":""},{"$f":"_xlfn.IFS(F8=\"\",\"\",F8=F14,\"32\",F8=F15,\"64\",F8=F16,\"98\",F8=F17,\"126\",F8=F18,\"139\",F8=F19,\"140\",F8=F20,\"32\",F8=F21,\"64\",F8=F22,\"98\",F8=F23,\"126\",F8=F24,\"139\",F8=F25,\"140\",F8=F26,\"32\",F8=F27,\"64\",F8=F28,\"126\")","v":""}]
[null,null,null,{"$f":"_xlfn.IFS(F9=\"\",0,F9=F14,'Cost Data'!D1009,F9=F15,'Cost Data'!D1010,F9=F16,'Cost Data'!D1011,F9=F17,'Cost Data'!D1012,F9=F18,'Cost Data'!D1013,F9=F19,'Cost Data'!D1014,F9=F20,'Cost Data'!D1009,F9=F21,'Cost Data'!D1010,F9=F22,'Cost Data'!D1011,F9=F23,'Cost Data'!D1012,F9=F24,'Cost Data'!D1013,F9=F25,'Cost Data'!D1014,F9=F26,'Cost Data'!D1009,F9=F27,'Cost Data'!D1010,F9=F28,'Cost Data'!D1012)","v":0},"Option 4",null,{"$f":"_xlfn.IFS(B2=\"FT430W\",F17,B2=\"FT430P\",\"\",B2=\"FT440W\",F23,B2=\"FT440P\",\"\",B2=\"FT450W\",\"\",B2=\"Please Select\",\"\",B2=\"\",\"\")","v":""},{"$f":"_xlfn.IFS(F9=\"\",\"\",F9=F14,\"32\",F9=F15,\"64\",F9=F16,\"98\",F9=F17,\"126\",F9=F18,\"139\",F9=F19,\"140\",F9=F20,\"32\",F9=F21,\"64\",F9=F22,\"98\",F9=F23,\"126\",F9=F24,\"139\",F9=F25,\"140\",F9=F26,\"32\",F9=F27,\"64\",F9=F28,\"126\")","v":""}]
[null,null,null,{"$f":"_xlfn.IFS(F10=\"\",0,F10=F14,'Cost Data'!D1009,F10=F15,'Cost Data'!D1010,F10=F16,'Cost Data'!D1011,F10=F17,'Cost Data'!D1012,F10=F18,'Cost Data'!D1013,F10=F19,'Cost Data'!D1014,F10=F20,'Cost Data'!D1009,F10=F21,'Cost Data'!D1010,F10=F22,'Cost Data'!D1011,F10=F23,'Cost Data'!D1012,F10=F24,'Cost Data'!D1013,F10=F25,'Cost Data'!D1014,F10=F26,'Cost Data'!D1009,F10=F27,'Cost Data'!D1010,F10=F28,'Cost Data'!D1012)","v":0},"Option 5",null,{"$f":"_xlfn.IFS(H6=\"139\",\"\",H7=\"139\",\"\",H8=\"139\",\"\",H9=\"139\",\"\",H10=\"139\",\"\",H6=\"140\",\"\",H7=\"140\",\"\",H8=\"140\",\"\",H9=\"140\",\"\",H10=\"140\",\"\",B2=\"FT430W\",F18,B2=\"FT430P\",\"\",B2=\"FT440W\",F24,B2=\"FT440P\",\"\",B2=\"FT450W\",\"\",B2=\"Please Select\",\"\",B2=\"\",\"\")","v":""},{"$f":"_xlfn.IFS(F10=\"\",\"\",F10=F14,\"32\",F10=F15,\"64\",F10=F16,\"98\",F10=F17,\"126\",F10=F18,\"139\",F10=F19,\"140\",F10=F20,\"32\",F10=F21,\"64\",F10=F22,\"98\",F10=F23,\"126\",F10=F24,\"139\",F10=F25,\"140\",F10=F26,\"32\",F10=F27,\"64\",F10=F28,\"126\")","v":""}]
[null,null,null,{"$f":"_xlfn.IFS(F11=\"\",0,F11=F14,'Cost Data'!D1009,F11=F15,'Cost Data'!D1010,F11=F16,'Cost Data'!D1011,F11=F17,'Cost Data'!D1012,F11=F18,'Cost Data'!D1013,F11=F19,'Cost Data'!D1014,F11=F20,'Cost Data'!D1009,F11=F21,'Cost Data'!D1010,F11=F22,'Cost Data'!D1011,F11=F23,'Cost Data'!D1012,F11=F24,'Cost Data'!D1013,F11=F25,'Cost Data'!D1014,F11=F26,'Cost Data'!D1009,F11=F27,'Cost Data'!D1010,F11=F28,'Cost Data'!D1012)","v":0},"Option 6",null,{"$f":"_xlfn.IFS(H6=\"139\",\"\",H7=\"139\",\"\",H8=\"139\",\"\",H9=\"139\",\"\",H10=\"139\",\"\",H6=\"140\",\"\",H7=\"140\",\"\",H8=\"140\",\"\",H9=\"140\",\"\",H10=\"140\",\"\",B2=\"FT430W\",F19,B2=\"FT430P\",\"\",B2=\"FT440W\",F25,B2=\"FT440P\",\"\",B2=\"FT450W\",\"\",B2=\"Please Select\",\"\",B2=\"\",\"\")","v":""},{"$f":"_xlfn.IFS(F11=\"\",\"\",F11=F14,\"32\",F11=F15,\"64\",F11=F16,\"98\",F11=F17,\"126\",F11=F18,\"139\",F11=F19,\"140\",F11=F20,\"32\",F11=F21,\"64\",F11=F22,\"98\",F11=F23,\"126\",F11=F24,\"139\",F11=F25,\"140\",F11=F26,\"32\",F11=F27,\"64\",F11=F28,\"126\")","v":""}]
[null,null,null,null,"Please Select",{"$f":"_xlfn.TEXTJOIN(\"-\",TRUE,H6:H11)","v":""}]
[null,null,"Description",null,null,null,"All Options"]
["FT430","DC Powered","DC Powered Transmitter ",null,"Wall Mount - W","Tamper-evident = -32","Tamper-evident = -32"]
[null,null,"Scaled Pulse Output, High Alarm or Low Alarm Output, Opto Isolated",null,null,"Non-resettable total = -64","Non-resettable total = -64"]
[null,null,"Pulse Pass Through",null,null,"Dual Relay Output = -98","Dual Relay Output = -98"]
[null,null,null,null,"Panel Mount - P","Display Cover Kit = -126","Display Cover Kit = -126"]
[null,null,null,null,null,"Built in 120/240 Vac/12/24 dual power supply = -139","Built in 120/240 Vac/12/24 dual power supply = -139"]
[null,null,null,null,null,"Built-in 120/240 Vac /12 Vdc single power supply = -140","Built-in 120/240 Vac /12 Vdc single power supply = -140"]
["FT440","4-20mA Output","DC Powered Transmitter ",null,"Wall Mount - W","Tamper-evident = -32"]
[null,null,"Scaled Pulse Output, High Alarm or Low Alarm Output, Opto Isolated",null,null,"Non-resettable total = -64"]
[null,null,"Pulse Pass Through",null,null,"Dual Relay Output = -98"]
[null,null,"Scaled Pulse Output, High Alarm or Low Alarm Output, Opto Isolated",null,"Panel Mount - P","Display Cover Kit = -126"]
[null,null,"4-20mA Output",null,null,"Built in 120/240 Vac/12/24 dual power supply = -139"]
[null,null,null,null,null,"Built-in 120/240 Vac /12 Vdc single power supply = -140"]
["FT450","Battery Powered","Battery Powered Transmitter ",null,"Wall Mount - W","Tamper-evident = -32"]
[null,null,"Scaled Pulse Output, High Alarm or Low Alarm Output",null,null,"Non-resettable total = -64"]
[null,null,"Pulse Pass Through",null,null,"Display Cover Kit = -126"]
[]
[]
[]
[]
[]
["FT430/440/450 Parts & Accessories"]
["Model #",null,"Description",null,null,null,"Price"]
[{"$f":"'Cost Data'!B1016","v":"103591-01"},null,{"$f":"'Cost Data'!C1016","v":"FT430 Replacement Module"},null,null,null,{"$f":"'Cost Data'!D1016","v":420}]
[{"$f":"'Cost Data'!B1017","v":"103591-02"},null,{"$f":"'Cost Data'!C1017","v":"FT440 Replacement Module"},null,null,null,{"$f":"'Cost Data'!D1017","v":499}]
[{"$f":"'Cost Data'!B1018","v":"103591-03"},null,{"$f":"'Cost Data'!C1018","v":"FT450 Replacement Module"},null,null,null,{"$f":"'Cost Data'!D1018","v":551}]
[{"$f":"'Cost Data'!B1019","v":103391},null,{"$f":"'Cost Data'!C1019","v":"Adapter Kit: New FT to old lower housing, Standard"},null,null,null,{"$f":"'Cost Data'!D1019","v":120}]
[{"$f":"'Cost Data'!B1020","v":103392},null,{"$f":"'Cost Data'!C1020","v":"Adapter Kit: New FT to old lower housing, Tamper Evident"},null,null,null,{"$f":"'Cost Data'!D1020","v":145}]
[{"$f":"'Cost Data'!B1021","v":103594},null,{"$f":"'Cost Data'!C1021","v":"MK15, Wall to Meter Mount Kit, FT430/440/450"},null,null,null,{"$f":"'Cost Data'!D1021","v":140}]
[{"$f":"'Cost Data'!B1022","v":103396},null,{"$f":"'Cost Data'!C1022","v":"MK25, Meter to Wall Mount Kit, FT430/440/450"},null,null,null,{"$f":"'Cost Data'!D1022","v":211}]
[{"$f":"'Cost Data'!B1023","v":102021},null,{"$f":"'Cost Data'!C1023","v":"Hinged Display Cover Kit"},null,null,null,{"$f":"'Cost Data'!D1023","v":64}]
[{"$f":"'Cost Data'!B1024","v":104027},null,{"$f":"'Cost Data'!C1024","v":"Security Hinged Display Cover Kit"},null,null,null,{"$f":"'Cost Data'!D1024","v":64}]
[{"$f":"'Cost Data'!B1025","v":100013},null,{"$f":"'Cost Data'!C1025","v":"Cable Assy, 12' Unshielded, 3 Con, LMI 4-Pin Connector, 1K Resistor"},null,null,null,{"$f":"'Cost Data'!D1025","v":54}]
[{"$f":"'Cost Data'!B1026","v":100039},null,{"$f":"'Cost Data'!C1026","v":"Cable Assy, 12' Unshielded, 2 Con, LMI 4-Pin Connector"},null,null,null,{"$f":"'Cost Data'!D1026","v":54}]
[{"$f":"'Cost Data'!B1027","v":103702},null,{"$f":"'Cost Data'!C1027","v":"White Housing Screw/Washer Kit"},null,null,null,{"$f":"'Cost Data'!D1027","v":4}]
[{"$f":"'Cost Data'!B1028","v":"PC42"},null,{"$f":"'Cost Data'!C1028","v":"Dual Power Converter 110-115 Vac, 12-24 Vdc, Regulated"},null,null,null,{"$f":"'Cost Data'!D1028","v":353}]
[{"$f":"'Cost Data'!B1029","v":"PC3"},null,{"$f":"'Cost Data'!C1029","v":"110-115 Vac, 24 Vdc, Unregulated"},null,null,null,{"$f":"'Cost Data'!D1029","v":80}]
[{"$f":"'Cost Data'!B1030","v":100373},null,{"$f":"'Cost Data'!C1030","v":"Battery, Lithium, 3.6V, 8.5Ah, C Size"},null,null,null,{"$f":"'Cost Data'!D1030","v":67}]
[{"$f":"'Cost Data'!B1031","v":102025},null,{"$f":"'Cost Data'!C1031","v":"Upper Housing Seal"},null,null,null,{"$f":"'Cost Data'!D1031","v":21}]
[{"$f":"'Cost Data'!B1032","v":100360},null,{"$f":"'Cost Data'!C1032","v":"Steel Housing Plug (Battery Units)"},null,null,null,{"$f":"'Cost Data'!D1032","v":21}]
[{"$f":"'Cost Data'!B1033","v":103811},null,{"$f":"'Cost Data'!C1033","v":"Cover Hardware Kit for FT430P/FT440P"},null,null,null,{"$f":"'Cost Data'!D1033","v":13}]
[100014,null,"Cable, Unshielded, 4 Con, FT440, (Per Ft.)",null,null,null,{"$f":"'Cost Data'!D903","v":4}]

{"sheet":"IP100-200","index":11,"n_rows":187,"n_cols":8,"rows_kept":187,"cut":false,"hidden":false,"merged":[[182,0,182,1],[182,2,182,5],[183,0,183,1],[183,2,183,5],[184,0,184,1],[184,2,184,5],[185,0,185,1],[185,2,185,5],[186,0,186,1],[186,2,186,5],[177,0,177,1],[177,2,177,5],[178,0,178,1],[178,2,178,5],[179,0,179,1],[179,2,179,5],[180,0,180,1],[180,2,180,5],[181,0,181,1],[181,2,181,5],[172,0,172,1],[172,2,172,5],[173,0,173,1],[173,2,173,5],[174,0,174,1],[174,2,174,5],[175,0,175,1],[175,2,175,5],[176,0,176,1],[176,2,176,5],[166,0,166,1],[166,2,166,5],[167,0,167,1],[167,2,167,5],[168,0,168,1],[168,2,168,5],[170,0,170,6],[171,0,171,1],[171,2,171,5],[161,0,161,1],[161,2,161,5],[162,0,162,1],[162,2,162,5],[163,0,163,1],[163,2,163,5],[164,0,164,1],[164,2,164,5],[165,0,165,1],[165,2,165,5],[156,0,156,6],[157,0,157,1],[157,2,157,5],[158,0,158,1],[158,2,158,5],[159,0,159,1],[159,2,159,5],[160,0,160,1],[160,2,160,5],[154,0,154,1],[154,2,154,5],[155,0,155,1],[155,2,155,5],[151,0,151,1],[151,2,151,5],[152,0,152,1],[152,2,152,5],[153,0,153,1],[153,2,153,5],[148,0,148,1],[148,2,148,5],[149,0,149,1],[149,2,149,5],[150,0,150,1],[150,2,150,5],[145,0,145,1],[145,2,145,5],[146,0,146,1],[146,2,146,5],[147,0,147,1],[147,2,147,5],[141,0,141,6],[142,0,142,1],[142,2,142,5],[143,0,143,1],[143,2,143,5],[144,0,144,1],[144,2,144,5],[137,0,137,1],[137,2,137,5],[138,0,138,1],[138,2,138,5],[139,0,139,1],[139,2,139,5],[134,0,134,1],[134,2,134,5],[135,0,135,1],[135,2,135,5],[136,0,136,1],[136,2,136,5],[130,0,130,6],[131,0,131,1],[131,2,131,5],[132,0,132,1],[132,2,132,5],[133,0,133,1],[133,2,133,5],[126,0,126,1],[126,2,126,5],[127,0,127,1],[127,2,127,5],[128,0,128,1],[128,2,128,5],[123,0,123,1],[123,2,123,5],[124,0,124,1],[124,2,124,5],[125,0,125,1],[125,2,125,5],[120,0,120,1],[120,2,120,5],[121,0,121,1],[121,2,121,5],[122,0,122,1],[122,2,122,5],[117,0,117,1],[117,2,117,5],[118,0,118,1],[118,2,118,5],[119,0,119,1],[119,2,119,5],[113,0,113,6],[114,0,114,1],[114,2,114,5],[115,0,115,1],[115,2,115,5],[116,0,116,1],[116,2,116,5],[110,0,110,1],[110,2,110,5],[111,0,111,1],[111,2,111,5],[112,0,112,1],[112,2,112,5],[107,0,107,1],[107,2,107,5],[108,0,108,1],[108,2,108,5],[109,0,109,1],[109,2,109,5],[104,0,104,1],[104,2,104,5],[105,0,105,1],[105,2,105,5],[106,0,106,1],[106,2,106,5],[101,0,101,1],[101,2,101,5],[102,0,102,1],[102,2,102,5],[103,0,103,1],[103,2,103,5],[97,0,97,6],[98,0,98,1],[98,2,98,5],[99,0,99,1],[99,2,99,5],[100,0,100,1],[100,2,100,5],[57,0,66,0],[57,1,66,1],[69,0,80,0],[69,1,80,1],[83,0,95,0],[83,1,95,1],[1,2,1,4],[1,5,1,6],[3,3,3,5],[26,0,39,0],[26,1,39,1],[42,0,54,0],[42,1,54,1],[5,0,5,1],[16,0,16,1]]}
[]
[null,{"$f":"_xlfn.TEXTJOIN(\"\",TRUE,C25,D25)","v":"Please SelectPlease Select"},{"$f":"E25","v":""},null,null,{"$f":"_xlfn.TEXTJOIN(\"-\",TRUE,B2,C2)","v":"Please SelectPlease Select"}]
[null,"Meter","Options"]
["Costs",{"$f":"_xlfn.IFS(B2=\"IP110B\",'Cost Data'!D253,B2=\"IP110P\",'Cost Data'!D254,B2=\"IP110S\",'Cost Data'!D255,\nB2=\"IP210B\",'Cost Data'!D256,B2=\"IP210P\",'Cost Data'!D257,B2=\"IP210S\",'Cost Data'!D258,\nB2=\"IP150B\",'Cost Data'!D259,B2=\"IP150P\",'Cost Data'!D260,B2=\"IP150S\",'Cost Data'!D261,\nB2=\"IP250B\",'Cost Data'!D262,B2=\"IP250P\",'Cost Data'!D263,B2=\"IP250S\",'Cost Data'!D264,\nB2=\"IP113B\",'Cost Data'!D265,B2=\"IP113P\",'Cost Data'!D266,B2=\"IP113S\",'Cost Data'!D267,\nB2=\"IP213B\",'Cost Data'!D268,B2=\"IP213P\",'Cost Data'!D269,B2=\"IP213S\",'Cost Data'!D270,\nB2=\"IP153B\",'Cost Data'!D271,B2=\"IP153P\",'Cost Data'!D272,B2=\"IP153S\",'Cost Data'!D273,\nB2=\"IP253B\",'Cost Data'!D274,B2=\"IP253P\",'Cost Data'!D275,B2=\"IP253S\",'Cost Data'!D276,\nB2=\"IP116B\",'Cost Data'!D277,B2=\"IP116P\",'Cost Data'!D278,B2=\"IP116S\",'Cost Data'!D279,\nB2=\"IP216B\",'Cost Data'!D280,B2=\"IP216P\",'Cost Data'!D281,B2=\"IP216S\",'Cost Data'!D282,\nB2=\"IP156B\",'Cost Data'!D283,B2=\"IP156P\",'Cost Data'!D284,B2=\"IP156S\",'Cost Data'!D285,\nB2=\"IP256B\",'Cost Data'!D286,B2=\"IP256P\",'Cost Data'!D287,B2=\"IP256S\",'Cost Data'!D288,\nB2=\"IP117B\",'Cost Data'!D289,B2=\"IP117P\",'Cost Data'!D290,B2=\"IP117S\",'Cost Data'!D291,\nB2=\"IP217B\",'Cost Data'!D292,B2=\"IP217P\",'Cost Data'!D293,B2=\"IP217S\",'Cost Data'!D294,\nB2=\"IP157B\",'Cost Data'!D295,B2=\"IP157P\",'Cost Data'!D296,B2=\"IP157S\",'Cost Data'!D297,\nB2=\"IP257B\",'Cost Data'!D298,B2=\"IP257P\",'Cost Data'!D299,B2=\"IP257S\",'Cost Data'!D300,\nB2=\"IP119B\",'Cost Data'!D301,B2=\"IP119P\",'Cost Data'!D302,B2=\"IP119S\",'Cost Data'!D303,\nB2=\"IP219B\",'Cost Data'!D304,B2=\"IP219P\",'Cost Data'!D305,B2=\"IP219S\",'Cost Data'!D306,\nB2=\"IP159B\",'Cost Data'!D307,B2=\"IP159P\",'Cost Data'!D308,B2=\"IP159S\",'Cost Data'!D309, B2=\"IP259B\",'Cost Data'!D310,B2=\"IP259P\",'Cost Data'!D311,B2=\"IP259S\",'Cost Data'!D312)","v":{"$error":"#N/A"}},{"$f":"SUM(C6:C24)","v":0},"Total",null,null,{"$f":"B4+C4","v":{"$error":"#N/A"}}]
[null,null,null,null,null,"Available Options","All Options"]
[null,null,{"$f":"_xlfn.IFS(E6=\"\",0,E6=G6,'Cost Data'!D313,E6=G7,'Cost Data'!D314,E6=G8,'Cost Data'!D315,E6=G9,'Cost Data'!D316,E6=G10,'Cost Data'!D317,E6=G11,'Cost Data'!D318,E6=G12,'Cost Data'!D319,E6=G13,'Cost Data'!D320,E6=G14,'Cost Data'!D323,E6=G15,'Cost Data'!D324,E6=G16,'Cost Data'!D325,E6=G17,'Cost Data'!D326,E6=G18,'Cost Data'!D327,E6=G19,'Cost Data'!D328,E6=G20,'Cost Data'!D329,E6=G21,'Cost Data'!D330,E6=G22,'Cost Data'!D331)","v":0},"Option 1",null,{"$f":"_xlfn.IFS(D25=\"Please Select\", \"\",C25=\"\",\"#N/A\",C25<>\"Please Select\",G6,C25=\"Please Select\", \"\")","v":""},"Rotor with Ceramic Shaft PVDF Kynar = -01",{"$f":"_xlfn.IFS(E6=\"\",\"\",E6= G6,\"01\",E6=G7,\"02\",E6=G8, \"02\",E6=G9,\"04\",E6=G10,\"06\",E6=G11,\"07\",E6=G12,\"08\",E6=G13,\"09\",E6=G14, \"32\",E6=G15, \"35\",E6=G16,\"40\",E6=G17,\"64\", E6=G18,\"68\",E6=G19,\"72\",E6=G20,\"98\",E6=G21,\"106\",E6=G22,\"126\")","v":""}]
[null,null,{"$f":"_xlfn.IFS(E7=\"\",0,E7=G6,'Cost Data'!D313,E7=G7,'Cost Data'!D314,E7=G8,'Cost Data'!D315,E7=G9,'Cost Data'!D316,E7=G10,'Cost Data'!D317,E7=G11,'Cost Data'!D318,E7=G12,'Cost Data'!D319,E7=G13,'Cost Data'!D320,E7=G14,'Cost Data'!D323,E7=G15,'Cost Data'!D324,E7=G16,'Cost Data'!D325,E7=G17,'Cost Data'!D326,E7=G18,'Cost Data'!D327,E7=G19,'Cost Data'!D328,E7=G20,'Cost Data'!D329,E7=G21,'Cost Data'!D330,E7=G22,'Cost Data'!D331)","v":0},"Option 2",null,{"$f":"_xlfn.IFS(D25=\"Please Select\", \"\",C25=\"Please Select\", \"\",B2=\"IP110B\",F28, B2=\"IP110S\",F29, B2=\"IP110P\",F30, B2=\"IP210B\",F28, B2=\"IP210S\",F29, B2=\"IP210P\",F30, B2=\"IP150B\", G28, B2=\"IP150S\", G28, B2=\"IP150P\", G28, B2=\"IP250B\", G28, B2=\"IP250S\", G28, B2=\"IP250P\", G28, B2=\"IP113B\", F44, B2=\"IP113S\", F45, B2=\"IP113P\", F46, B2=\"IP213B\", F44, B2=\"IP213S\", F45, B2=\"IP213P\", F46, B2=\"IP153B\", G45, B2=\"IP153S\", G44, B2=\"IP153P\", G45, B2=\"IP253B\", G45, B2=\"IP253S\", G44, B2=\"IP253P\", G45, B2=\"IP116B\", F59, B2=\"IP116S\", F60, B2=\"IP116P\", F61,B2=\"IP216B\", F59, B2=\"IP216S\", F60, B2=\"IP216P\", F61, B2=\"IP156B\", G60, B2=\"IP156S\", G59, B2=\"IP156P\", G60, B2=\"IP256B\", G60, B2=\"IP256S\", G59, B2=\"IP256P\", G60, B2=\"IP117B\", F71, B2=\"IP117S\", F72, B2=\"IP117P\", F73,  B2=\"IP217B\", F71, B2=\"IP217S\", F72, B2=\"IP217P\", F73, B2=\"IP157B\", G72, B2=\"IP157S\", G71, B2=\"IP157P\", G72,  B2=\"IP257B\", G72, B2=\"IP257S\", G71, B2=\"IP257P\", G72, B2=\"IP119B\", F85, B2=\"IP119S\", F86, B2=\"IP119P\", F87, B2=\"IP219B\", F85, B2=\"IP219S\", F86, B2=\"IP219P\", F87, B2=\"IP159B\",G86, B2=\"IP159S\", G85, B2=\"IP159P\", G86, B2=\"IP259B\",G86, B2=\"IP259S\", G85, B2=\"IP259P\", G86)","v":""},"Brass Adapter Fitting 2 inch NPT = -02",{"$f":"_xlfn.IFS(E7=\"\",\"\",E7= G6,\"01\",E7=G7,\"02\",E7=G8, \"02\",E7=G9,\"04\",E7=G10,\"06\",E7=G11,\"07\",E7=G12,\"08\",E7=G13,\"09\",E7=G14, \"32\",E7=G15, \"35\",E7=G16,\"40\",E7=G17,\"64\", E7=G18,\"68\",E7=G19,\"72\",E7=G20,\"98\",E7=G21,\"106\",E7=G22,\"126\")","v":""}]
[null,null,{"$f":"_xlfn.IFS(E8=\"\",0,E8=G6,'Cost Data'!D313,E8=G7,'Cost Data'!D314,E8=G8,'Cost Data'!D315,E8=G9,'Cost Data'!D316,E8=G10,'Cost Data'!D317,E8=G11,'Cost Data'!D318,E8=G12,'Cost Data'!D319,E8=G13,'Cost Data'!D320,E8=G14,'Cost Data'!D323,E8=G15,'Cost Data'!D324,E8=G16,'Cost Data'!D325,E8=G17,'Cost Data'!D326,E8=G18,'Cost Data'!D327,E8=G19,'Cost Data'!D328,E8=G20,'Cost Data'!D329,E8=G21,'Cost Data'!D330,E8=G22,'Cost Data'!D331)","v":0},"Option 3",null,{"$f":"_xlfn.IFS(D25=\"Please Select\", \"\",C25=\"Please Select\", \"\",B2=\"IP110B\",F30, B2=\"IP110S\",F30, B2=\"IP110P\",F31, B2=\"IP210B\",F30, B2=\"IP210S\",F30, B2=\"IP210P\",F31, B2=\"IP150B\", G29, B2=\"IP150S\", G29, B2=\"IP150P\", G29, B2=\"IP250B\", G29, B2=\"IP250S\", G29, B2=\"IP250P\", G29, B2=\"IP113B\", F46, B2=\"IP113S\", F46, B2=\"IP113P\", F47, B2=\"IP213B\", F46, B2=\"IP213S\", F46, B2=\"IP213P\", F47, B2=\"IP153B\", G46, B2=\"IP153S\", G45, B2=\"IP153P\", G46, B2=\"IP253B\", G46, B2=\"IP253S\", G45, B2=\"IP253P\", G46, B2=\"IP116B\", F61, B2=\"IP116S\", F61, B2=\"IP116P\", F62,B2=\"IP216B\", F61, B2=\"IP216S\", F61, B2=\"IP216P\", F62, B2=\"IP156B\", G61, B2=\"IP156S\", G60, B2=\"IP156P\", G61, B2=\"IP256B\", G61, B2=\"IP256S\", G60, B2=\"IP256P\", G61, B2=\"IP117B\", F73, B2=\"IP117S\", F73, B2=\"IP117P\", F74,  B2=\"IP217B\", F73, B2=\"IP217S\", F73, B2=\"IP217P\", F74, B2=\"IP157B\", G73, B2=\"IP157S\", G72, B2=\"IP157P\", G73,  B2=\"IP257B\", G73, B2=\"IP257S\", G72, B2=\"IP257P\", G73, B2=\"IP119B\", F87, B2=\"IP119S\", F87, B2=\"IP119P\", F88, B2=\"IP219B\", F87, B2=\"IP219S\", F87, B2=\"IP219P\", F88, B2=\"IP159B\",G87, B2=\"IP159S\", G86, B2=\"IP159P\", G87, B2=\"IP259B\",G87, B2=\"IP259S\", G86, B2=\"IP259P\", G87)","v":""},"SS Adapter Fitting 2 inch NPT = -02",{"$f":"_xlfn.IFS(E8=\"\",\"\",E8= G6,\"01\",E8=G7,\"02\",E8=G8, \"02\",E8=G9,\"04\",E8=G10,\"06\",E8=G11,\"07\",E8=G12,\"08\",E8=G13,\"09\",E8=G14, \"32\",E8=G15, \"35\",E8=G16,\"40\",E8=G17,\"64\", E8=G18,\"68\",E8=G19,\"72\",E8=G20,\"98\",E8=G21,\"106\",E8=G22,\"126\")","v":""}]
[null,null,{"$f":"_xlfn.IFS(E9=\"\",0,E9=G6,'Cost Data'!D313,E9=G7,'Cost Data'!D314,E9=G8,'Cost Data'!D315,E9=G9,'Cost Data'!D316,E9=G10,'Cost Data'!D317,E9=G11,'Cost Data'!D318,E9=G12,'Cost Data'!D319,E9=G13,'Cost Data'!D320,E9=G14,'Cost Data'!D323,E9=G15,'Cost Data'!D324,E9=G16,'Cost Data'!D325,E9=G17,'Cost Data'!D326,E9=G18,'Cost Data'!D327,E9=G19,'Cost Data'!D328,E9=G20,'Cost Data'!D329,E9=G21,'Cost Data'!D330,E9=G22,'Cost Data'!D331)","v":0},"Option 4",null,{"$f":"_xlfn.IFS(D25=\"Please Select\", \"\",C25=\"Please Select\", \"\",B2=\"IP110B\",F31, B2=\"IP110S\",F31, B2=\"IP110P\",F32, B2=\"IP210B\",F31, B2=\"IP210S\",F31, B2=\"IP210P\",F32, B2=\"IP150B\", G30, B2=\"IP150S\", G30, B2=\"IP150P\", G30, B2=\"IP250B\", G30, B2=\"IP250S\", G30, B2=\"IP250P\", G30, B2=\"IP113B\", F47, B2=\"IP113S\", F47, B2=\"IP113P\", F48, B2=\"IP213B\", F47, B2=\"IP213S\", F47, B2=\"IP213P\", F48, B2=\"IP153B\", G47, B2=\"IP153S\", G46, B2=\"IP153P\", G47, B2=\"IP253B\", G47, B2=\"IP253S\", G46, B2=\"IP253P\", G47, B2=\"IP116B\", F62, B2=\"IP116S\", F62, B2=\"IP116P\", F63,B2=\"IP216B\", F62, B2=\"IP216S\", F62, B2=\"IP216P\", F63, B2=\"IP156B\", G62, B2=\"IP156S\", G61, B2=\"IP156P\", G62, B2=\"IP256B\", G62, B2=\"IP256S\", G61, B2=\"IP256P\", G62, B2=\"IP117B\", F74, B2=\"IP117S\", F74, B2=\"IP117P\", F75,  B2=\"IP217B\", F74, B2=\"IP217S\", F74, B2=\"IP217P\", F75, B2=\"IP157B\", G74, B2=\"IP157S\", G73, B2=\"IP157P\", G74,  B2=\"IP257B\", G74, B2=\"IP257S\", G73, B2=\"IP257P\", G74, B2=\"IP119B\", F88, B2=\"IP119S\", F88, B2=\"IP119P\", F89, B2=\"IP219B\", F88, B2=\"IP219S\", F88, B2=\"IP219P\", F89, B2=\"IP159B\",G88, B2=\"IP159S\", G87, B2=\"IP159P\", G88, B2=\"IP259B\",G88, B2=\"IP259S\", G87, B2=\"IP259P\", G88)","v":""},"Micropower Pickup -Required for use with FT450 = -04",{"$f":"_xlfn.IFS(E9=\"\",\"\",E9= G6,\"01\",E9=G7,\"02\",E9=G8, \"02\",E9=G9,\"04\",E9=G10,\"06\",E9=G11,\"07\",E9=G12,\"08\",E9=G13,\"09\",E9=G14, \"32\",E9=G15, \"35\",E9=G16,\"40\",E9=G17,\"64\", E9=G18,\"68\",E9=G19,\"72\",E9=G20,\"98\",E9=G21,\"106\",E9=G22,\"126\")","v":""}]
[null,null,{"$f":"_xlfn.IFS(E10=\"\",0,E10=G6,'Cost Data'!D313,E10=G7,'Cost Data'!D314,E10=G8,'Cost Data'!D315,E10=G9,'Cost Data'!D316,E10=G10,'Cost Data'!D317,E10=G11,'Cost Data'!D318,E10=G12,'Cost Data'!D319,E10=G13,'Cost Data'!D320,E10=G14,'Cost Data'!D323,E10=G15,'Cost Data'!D324,E10=G16,'Cost Data'!D325,E10=G17,'Cost Data'!D326,E10=G18,'Cost Data'!D327,E10=G19,'Cost Data'!D328,E10=G20,'Cost Data'!D329,E10=G21,'Cost Data'!D330,E10=G22,'Cost Data'!D331)","v":0},"Option 5",null,{"$f":"_xlfn.IFS(D25=\"Please Select\", \"\",C25=\"Please Select\", \"\",B2=\"IP110B\",F32, B2=\"IP110S\",F32, B2=\"IP110P\",F33, B2=\"IP210B\",F32, B2=\"IP210S\",F32, B2=\"IP210P\",F33, B2=\"IP150B\", G32, B2=\"IP150S\", G31, B2=\"IP150P\", G32, B2=\"IP250B\", G32, B2=\"IP250S\", G31, B2=\"IP250P\", G32, B2=\"IP113B\", F48, B2=\"IP113S\", F48, B2=\"IP113P\", F49, B2=\"IP213B\", F48, B2=\"IP213S\", F48, B2=\"IP213P\", F49, B2=\"IP153B\", G48, B2=\"IP153S\", G47, B2=\"IP153P\", G48, B2=\"IP253B\", G48, B2=\"IP253S\", G47, B2=\"IP253P\", G48, B2=\"IP116B\", F63, B2=\"IP116S\", F63, B2=\"IP116P\", \"\",B2=\"IP216B\", F63, B2=\"IP216S\", F63, B2=\"IP216P\", \"\", B2=\"IP156B\", \"\", B2=\"IP156S\", G62, B2=\"IP156P\", \"\", B2=\"IP256B\", G63, B2=\"IP256S\", G62, B2=\"IP256P\", \"\", B2=\"IP117B\", F75, B2=\"IP117S\", F75, B2=\"IP117P\", F76,  B2=\"IP217B\", F75, B2=\"IP217S\", F75, B2=\"IP217P\", F76, B2=\"IP157B\", G75, B2=\"IP157S\", G74, B2=\"IP157P\", G75,  B2=\"IP257B\", G75, B2=\"IP257S\", G74, B2=\"IP257P\", G75, B2=\"IP119B\", F89, B2=\"IP119S\", F89, B2=\"IP119P\", F90, B2=\"IP219B\", F89, B2=\"IP219S\", F89, B2=\"IP219P\", F90, B2=\"IP159B\",G89, B2=\"IP159S\", G88, B2=\"IP159P\", G89, B2=\"IP259B\",G89, B2=\"IP259S\", G88, B2=\"IP259P\", G89)","v":""},"Standard Power LMI 4-pin Connector = -06",{"$f":"_xlfn.IFS(E10=\"\",\"\",E10= G6,\"01\",E10=G7,\"02\",E10=G8, \"02\",E10=G9,\"04\",E10=G10,\"06\",E10=G11,\"07\",E10=G12,\"08\",E10=G13,\"09\",E10=G14, \"32\",E10=G15, \"35\",E10=G16,\"40\",E10=G17,\"64\", E10=G18,\"68\",E10=G19,\"72\",E10=G20,\"98\",E10=G21,\"106\",E10=G22,\"126\")","v":""}]
[null,null,{"$f":"_xlfn.IFS(E11=\"\",0,E11=G6,'Cost Data'!D313,E11=G7,'Cost Data'!D314,E11=G8,'Cost Data'!D315,E11=G9,'Cost Data'!D316,E11=G10,'Cost Data'!D317,E11=G11,'Cost Data'!D318,E11=G12,'Cost Data'!D319,E11=G13,'Cost Data'!D320,E11=G14,'Cost Data'!D323,E11=G15,'Cost Data'!D324,E11=G16,'Cost Data'!D325,E11=G17,'Cost Data'!D326,E11=G18,'Cost Data'!D327,E11=G19,'Cost Data'!D328,E11=G20,'Cost Data'!D329,E11=G21,'Cost Data'!D330,E11=G22,'Cost Data'!D331)","v":0},"Option 6",null,{"$f":"_xlfn.IFS(D25=\"Please Select\", \"\",C25=\"Please Select\", \"\",B2=\"IP110B\",F33, B2=\"IP110S\",F33, B2=\"IP110P\",F34, B2=\"IP210B\",F33, B2=\"IP210S\",F33, B2=\"IP210P\",F34, B2=\"IP150B\", G33, B2=\"IP150S\", G32, B2=\"IP150P\", G33, B2=\"IP250B\", G33, B2=\"IP250S\", G32, B2=\"IP250P\", G33, B2=\"IP113B\", F49, B2=\"IP113S\", F49, B2=\"IP113P\", F51, B2=\"IP213B\", F49, B2=\"IP213S\", F49, B2=\"IP213P\", F51, B2=\"IP153B\", G50, B2=\"IP153S\", G48, B2=\"IP153P\", G50, B2=\"IP253B\", G49, B2=\"IP253S\", G48, B2=\"IP253P\", G50, B2=\"IP116B\", \"\", B2=\"IP116S\", \"\", B2=\"IP116P\", \"\",B2=\"IP216B\", F64, B2=\"IP216S\", F64, B2=\"IP216P\", \"\", B2=\"IP156B\", \"\", B2=\"IP156S\", \"\", B2=\"IP156P\", \"\", B2=\"IP256B\", \"\", B2=\"IP256S\", G63, B2=\"IP256P\", \"\", B2=\"IP117B\", F76, B2=\"IP117S\", F76, B2=\"IP117P\", F78,  B2=\"IP217B\", F76, B2=\"IP217S\", F76, B2=\"IP217P\", F78, B2=\"IP157B\", G77, B2=\"IP157S\", G75, B2=\"IP157P\", G77,  B2=\"IP257B\", G76, B2=\"IP257S\", G75, B2=\"IP257P\", G77, B2=\"IP119B\", F90, B2=\"IP119S\", F90, B2=\"IP119P\", F92, B2=\"IP219B\", F90, B2=\"IP219S\", F90, B2=\"IP219P\", F92, B2=\"IP159B\",G91, B2=\"IP159S\", G89, B2=\"IP159P\", G91, B2=\"IP259B\",G90, B2=\"IP259S\", G89, B2=\"IP259P\", G91)","v":""},"Stnd Power Seametrics Ctrl Connector = -07",{"$f":"_xlfn.IFS(E11=\"\",\"\",E11= G6,\"01\",E11=G7,\"02\",E11=G8, \"02\",E11=G9,\"04\",E11=G10,\"06\",E11=G11,\"07\",E11=G12,\"08\",E11=G13,\"09\",E11=G14, \"32\",E11=G15, \"35\",E11=G16,\"40\",E11=G17,\"64\", E11=G18,\"68\",E11=G19,\"72\",E11=G20,\"98\",E11=G21,\"106\",E11=G22,\"126\")","v":""}]
[null,null,{"$f":"_xlfn.IFS(E12=\"\",0,E12=G6,'Cost Data'!D313,E12=G7,'Cost Data'!D314,E12=G8,'Cost Data'!D315,E12=G9,'Cost Data'!D316,E12=G10,'Cost Data'!D317,E12=G11,'Cost Data'!D318,E12=G12,'Cost Data'!D319,E12=G13,'Cost Data'!D320,E12=G14,'Cost Data'!D323,E12=G15,'Cost Data'!D324,E12=G16,'Cost Data'!D325,E12=G17,'Cost Data'!D326,E12=G18,'Cost Data'!D327,E12=G19,'Cost Data'!D328,E12=G20,'Cost Data'!D329,E12=G21,'Cost Data'!D330,E12=G22,'Cost Data'!D331)","v":0},"Option 7",null,{"$f":"_xlfn.IFS(D25=\"Please Select\", \"\",C25=\"Please Select\", \"\",B2=\"IP110B\",F34, B2=\"IP110S\",F34, B2=\"IP110P\",F35, B2=\"IP210B\",F34, B2=\"IP210S\",F34, B2=\"IP210P\",F35, B2=\"IP150B\", G34, B2=\"IP150S\", G33, B2=\"IP150P\", G34, B2=\"IP250B\", G34, B2=\"IP250S\", G33, B2=\"IP250P\", G34, B2=\"IP113B\", F51, B2=\"IP113S\", F51, B2=\"IP113P\", F52, B2=\"IP213B\", F50, B2=\"IP213S\", F50, B2=\"IP213P\", F52, B2=\"IP153B\", G51, B2=\"IP153S\", G50, B2=\"IP153P\", G51, B2=\"IP253B\", G50, B2=\"IP253S\", G49, B2=\"IP253P\", G51, B2=\"IP116B\", \"\", B2=\"IP116S\", \"\", B2=\"IP116P\", \"\",B2=\"IP216B\", \"\", B2=\"IP216S\", \"\", B2=\"IP216P\", \"\", B2=\"IP156B\", \"\", B2=\"IP156S\", \"\", B2=\"IP156P\", \"\", B2=\"IP256B\", \"\", B2=\"IP256S\", \"\", B2=\"IP256P\", \"\", B2=\"IP117B\", F78, B2=\"IP117S\", F78, B2=\"IP117P\", \"\",  B2=\"IP217B\", F77, B2=\"IP217S\", F77, B2=\"IP217P\", \"\", B2=\"IP157B\", \"\", B2=\"IP157S\", G77, B2=\"IP157P\", \"\",  B2=\"IP257B\", G77, B2=\"IP257S\", G76, B2=\"IP257P\", \"\", B2=\"IP119B\", F92, B2=\"IP119S\", F92, B2=\"IP119P\", F93, B2=\"IP219B\", F91, B2=\"IP219S\", F91, B2=\"IP219P\", F93, B2=\"IP159B\",G92, B2=\"IP159S\", G91, B2=\"IP159P\", G92, B2=\"IP259B\",G91, B2=\"IP259S\", G90, B2=\"IP259P\", G92)","v":""},"316 SS Valve Assembly = -08",{"$f":"_xlfn.IFS(E12=\"\",\"\",E12= G6,\"01\",E12=G7,\"02\",E12=G8, \"02\",E12=G9,\"04\",E12=G10,\"06\",E12=G11,\"07\",E12=G12,\"08\",E12=G13,\"09\",E12=G14, \"32\",E12=G15, \"35\",E12=G16,\"40\",E12=G17,\"64\", E12=G18,\"68\",E12=G19,\"72\",E12=G20,\"98\",E12=G21,\"106\",E12=G22,\"126\")","v":""}]
[null,null,{"$f":"_xlfn.IFS(E13=\"\",0,E13=G6,'Cost Data'!D313,E13=G7,'Cost Data'!D314,E13=G8,'Cost Data'!D315,E13=G9,'Cost Data'!D316,E13=G10,'Cost Data'!D317,E13=G11,'Cost Data'!D318,E13=G12,'Cost Data'!D319,E13=G13,'Cost Data'!D320,E13=G14,'Cost Data'!D323,E13=G15,'Cost Data'!D324,E13=G16,'Cost Data'!D325,E13=G17,'Cost Data'!D326,E13=G18,'Cost Data'!D327,E13=G19,'Cost Data'!D328,E13=G20,'Cost Data'!D329,E13=G21,'Cost Data'!D330,E13=G22,'Cost Data'!D331)","v":0},"Option 8",null,{"$f":"_xlfn.IFS(D25=\"Please Select\", \"\",C25=\"Please Select\", \"\",B2=\"IP110B\",F35, B2=\"IP110S\",F35, B2=\"IP110P\",F37, B2=\"IP210B\",F35, B2=\"IP210S\",F35, B2=\"IP210P\",F37, B2=\"IP150B\", G36, B2=\"IP150S\", G34, B2=\"IP150P\", G36, B2=\"IP250B\", G35, B2=\"IP250S\", G34, B2=\"IP250P\", G36, B2=\"IP113B\", F52, B2=\"IP113S\", F52, B2=\"IP113P\", \"\", B2=\"IP213B\", F51, B2=\"IP213S\", F51, B2=\"IP213P\", \"\", B2=\"IP153B\", \"\", B2=\"IP153S\", G51, B2=\"IP153P\", \"\", B2=\"IP253B\", G51, B2=\"IP253S\", G50, B2=\"IP253P\", \"\", B2=\"IP116B\", \"\", B2=\"IP116S\", \"\", B2=\"IP116P\", \"\",B2=\"IP216B\", \"\", B2=\"IP216S\", \"\", B2=\"IP216P\", \"\", B2=\"IP156B\", \"\", B2=\"IP156S\", \"\", B2=\"IP156P\", \"\", B2=\"IP256B\", \"\", B2=\"IP256S\", \"\", B2=\"IP256P\", \"\", B2=\"IP117B\", \"\", B2=\"IP117S\", \"\", B2=\"IP117P\", \"\",  B2=\"IP217B\", F78, B2=\"IP217S\", F78, B2=\"IP217P\", \"\", B2=\"IP157B\", \"\", B2=\"IP157S\", \"\", B2=\"IP157P\", \"\",  B2=\"IP257B\", \"\", B2=\"IP257S\", G77, B2=\"IP257P\", \"\", B2=\"IP119B\", F93, B2=\"IP119S\", F93, B2=\"IP119P\", \"\", B2=\"IP219B\", F92, B2=\"IP219S\", F92, B2=\"IP219P\", \"\", B2=\"IP159B\",\"\", B2=\"IP159S\", G92, B2=\"IP159P\", \"\", B2=\"IP259B\",G92, B2=\"IP259S\", G91, B2=\"IP259P\", \"\")","v":""},"No Valve Assembly = -09",{"$f":"_xlfn.IFS(E13=\"\",\"\",E13= G6,\"01\",E13=G7,\"02\",E13=G8, \"02\",E13=G9,\"04\",E13=G10,\"06\",E13=G11,\"07\",E13=G12,\"08\",E13=G13,\"09\",E13=G14, \"32\",E13=G15, \"35\",E13=G16,\"40\",E13=G17,\"64\", E13=G18,\"68\",E13=G19,\"72\",E13=G20,\"98\",E13=G21,\"106\",E13=G22,\"126\")","v":""}]
[null,null,{"$f":"_xlfn.IFS(E14=\"\",0,E14=G6,'Cost Data'!D313,E14=G7,'Cost Data'!D314,E14=G8,'Cost Data'!D315,E14=G9,'Cost Data'!D316,E14=G10,'Cost Data'!D317,E14=G11,'Cost Data'!D318,E14=G12,'Cost Data'!D319,E14=G13,'Cost Data'!D320,E14=G14,'Cost Data'!D323,E14=G15,'Cost Data'!D324,E14=G16,'Cost Data'!D325,E14=G17,'Cost Data'!D326,E14=G18,'Cost Data'!D327,E14=G19,'Cost Data'!D328,E14=G20,'Cost Data'!D329,E14=G21,'Cost Data'!D330,E14=G22,'Cost Data'!D331)","v":0},"Option 9",null,{"$f":"_xlfn.IFS(D25=\"Please Select\", \"\",C25=\"Please Select\", \"\",B2=\"IP110B\",F37, B2=\"IP110S\",F37, B2=\"IP110P\",\"\", B2=\"IP210B\",F36, B2=\"IP210S\",F36, B2=\"IP210P\",\"\", B2=\"IP150B\", \"\", B2=\"IP150S\", G36, B2=\"IP150P\", \"\", B2=\"IP250B\", G36, B2=\"IP250S\", G35, B2=\"IP250P\", \"\", B2=\"IP113B\", \"\", B2=\"IP113S\", \"\", B2=\"IP113P\", \"\", B2=\"IP213B\", F52, B2=\"IP213S\", F52, B2=\"IP213P\", \"\", B2=\"IP153B\", \"\", B2=\"IP153S\", \"\", B2=\"IP153P\", \"\", B2=\"IP253B\", \"\", B2=\"IP253S\", G51, B2=\"IP253P\", \"\", B2=\"IP116B\", \"\", B2=\"IP116S\", \"\", B2=\"IP116P\", \"\",B2=\"IP216B\", \"\", B2=\"IP216S\", \"\", B2=\"IP216P\", \"\", B2=\"IP156B\", \"\", B2=\"IP156S\", \"\", B2=\"IP156P\", \"\", B2=\"IP256B\", \"\", B2=\"IP256S\", \"\", B2=\"IP256P\", \"\", B2=\"IP117B\", \"\", B2=\"IP117S\", \"\", B2=\"IP117P\", \"\",  B2=\"IP217B\", \"\", B2=\"IP217S\", \"\", B2=\"IP217P\", \"\", B2=\"IP157B\", \"\", B2=\"IP157S\", \"\", B2=\"IP157P\", \"\",  B2=\"IP257B\", \"\", B2=\"IP257S\", \"\", B2=\"IP257P\", \"\", B2=\"IP119B\", \"\", B2=\"IP119S\", \"\", B2=\"IP119P\", \"\", B2=\"IP219B\", F93, B2=\"IP219S\", F93, B2=\"IP219P\", \"\", B2=\"IP159B\",\"\", B2=\"IP159S\", \"\", B2=\"IP159P\", \"\", B2=\"IP259B\",\"\", B2=\"IP259S\", G92, B2=\"IP259P\", \"\")","v":""},"Tamper Evident Kit = -32",{"$f":"_xlfn.IFS(E14=\"\",\"\",E14= G6,\"01\",E14=G7,\"02\",E14=G8, \"02\",E14=G9,\"04\",E14=G10,\"06\",E14=G11,\"07\",E14=G12,\"08\",E14=G13,\"09\",E14=G14, \"32\",E14=G15, \"35\",E14=G16,\"40\",E14=G17,\"64\", E14=G18,\"68\",E14=G19,\"72\",E14=G20,\"98\",E14=G21,\"106\",E14=G22,\"126\")","v":""}]
[null,null,{"$f":"_xlfn.IFS(E15=\"\",0,E15=G6,'Cost Data'!D313,E15=G7,'Cost Data'!D314,E15=G8,'Cost Data'!D315,E15=G9,'Cost Data'!D316,E15=G10,'Cost Data'!D317,E15=G11,'Cost Data'!D318,E15=G12,'Cost Data'!D319,E15=G13,'Cost Data'!D320,E15=G14,'Cost Data'!D323,E15=G15,'Cost Data'!D324,E15=G16,'Cost Data'!D325,E15=G17,'Cost Data'!D326,E15=G18,'Cost Data'!D327,E15=G19,'Cost Data'!D328,E15=G20,'Cost Data'!D329,E15=G21,'Cost Data'!D330,E15=G22,'Cost Data'!D331)","v":0},"Option 10",null,{"$f":"_xlfn.IFS(D25=\"Please Select\", \"\",C25=\"Please Select\", \"\",B2=\"IP110B\",\"\", B2=\"IP110S\",\"\", B2=\"IP110P\",\"\", B2=\"IP210B\",F37, B2=\"IP210S\",F37, B2=\"IP210P\",\"\", B2=\"IP150B\", \"\", B2=\"IP150S\", \"\", B2=\"IP150P\", \"\", B2=\"IP250B\", \"\", B2=\"IP250S\", G36, B2=\"IP250P\", \"\", B2=\"IP113B\", \"\", B2=\"IP113S\", \"\", B2=\"IP113P\", \"\", B2=\"IP213B\", \"\", B2=\"IP213S\", \"\", B2=\"IP213P\", \"\", B2=\"IP153B\", \"\", B2=\"IP153S\", \"\", B2=\"IP153P\", \"\", B2=\"IP253B\", \"\", B2=\"IP253S\", \"\", B2=\"IP253P\", \"\", B2=\"IP116B\", \"\", B2=\"IP116S\", \"\", B2=\"IP116P\", \"\",B2=\"IP216B\", \"\", B2=\"IP216S\", \"\", B2=\"IP216P\", \"\", B2=\"IP156B\", \"\", B2=\"IP156S\", \"\", B2=\"IP156P\", \"\", B2=\"IP256B\", \"\", B2=\"IP256S\", \"\", B2=\"IP256P\", \"\", B2=\"IP117B\", \"\", B2=\"IP117S\", \"\", B2=\"IP117P\", \"\",  B2=\"IP217B\", \"\", B2=\"IP217S\", \"\", B2=\"IP217P\", \"\", B2=\"IP157B\", \"\", B2=\"IP157S\", \"\", B2=\"IP157P\", \"\",  B2=\"IP257B\", \"\", B2=\"IP257S\", \"\", B2=\"IP257P\", \"\", B2=\"IP119B\", \"\", B2=\"IP119S\", \"\", B2=\"IP119P\", \"\", B2=\"IP219B\", \"\", B2=\"IP219S\", \"\", B2=\"IP219P\", \"\", B2=\"IP159B\",\"\", B2=\"IP159S\", \"\", B2=\"IP159P\", \"\", B2=\"IP259B\",\"\", B2=\"IP259S\", \"\", B2=\"IP259P\", \"\")","v":""},"Old Style Adapter 1.5\" NPT = -35",{"$f":"_xlfn.IFS(E15=\"\",\"\",E15= G6,\"01\",E15=G7,\"02\",E15=G8, \"02\",E15=G9,\"04\",E15=G10,\"06\",E15=G11,\"07\",E15=G12,\"08\",E15=G13,\"09\",E15=G14, \"32\",E15=G15, \"35\",E15=G16,\"40\",E15=G17,\"64\", E15=G18,\"68\",E15=G19,\"72\",E15=G20,\"98\",E15=G21,\"106\",E15=G22,\"126\")","v":""}]
[null,null,null,null,null,null,"*Immersible = -40",{"$f":"_xlfn.IFS(E16=\"\",\"\",E16= G6,\"01\",E16=G7,\"02\",E16=G8, \"02\",E16=G9,\"04\",E16=G10,\"06\",E16=G11,\"07\",E16=G12,\"08\",E16=G13,\"09\",E16=G14, \"32\",E16=G15, \"35\",E16=G16,\"40\",E16=G17,\"64\", E16=G18,\"68\",E16=G19,\"72\",E16=G20,\"98\",E16=G21,\"106\",E16=G22,\"126\")","v":""}]
[null,null,null,null,null,null,"Non-resettable Total = -64",{"$f":"_xlfn.IFS(E17=\"\",\"\",E17= G6,\"01\",E17=G7,\"02\",E17=G8, \"02\",E17=G9,\"04\",E17=G10,\"06\",E17=G11,\"07\",E17=G12,\"08\",E17=G13,\"09\",E17=G14, \"32\",E17=G15, \"35\",E17=G16,\"40\",E17=G17,\"64\", E17=G18,\"68\",E17=G19,\"72\",E17=G20,\"98\",E17=G21,\"106\",E17=G22,\"126\")","v":""}]
[null,null,null,null,null,null,"Rotor -Kynar®/Silicon Carbide Shaft = -68",{"$f":"_xlfn.IFS(E18=\"\",\"\",E18= G6,\"01\",E18=G7,\"02\",E18=G8, \"02\",E18=G9,\"04\",E18=G10,\"06\",E18=G11,\"07\",E18=G12,\"08\",E18=G13,\"09\",E18=G14, \"32\",E18=G15, \"35\",E18=G16,\"40\",E18=G17,\"64\", E18=G18,\"68\",E18=G19,\"72\",E18=G20,\"98\",E18=G21,\"106\",E18=G22,\"126\")","v":""}]
[null,null,null,null,null,null,"12” Extension = -72",{"$f":"_xlfn.IFS(E19=\"\",\"\",E19= G6,\"01\",E19=G7,\"02\",E19=G8, \"02\",E19=G9,\"04\",E19=G10,\"06\",E19=G11,\"07\",E19=G12,\"08\",E19=G13,\"09\",E19=G14, \"32\",E19=G15, \"35\",E19=G16,\"40\",E19=G17,\"64\", E19=G18,\"68\",E19=G19,\"72\",E19=G20,\"98\",E19=G21,\"106\",E19=G22,\"126\")","v":""}]
[null,null,null,null,null,null,"Dual Relay Output = -98",{"$f":"_xlfn.IFS(E20=\"\",\"\",E20= G6,\"01\",E20=G7,\"02\",E20=G8, \"02\",E20=G9,\"04\",E20=G10,\"06\",E20=G11,\"07\",E20=G12,\"08\",E20=G13,\"09\",E20=G14, \"32\",E20=G15, \"35\",E20=G16,\"40\",E20=G17,\"64\", E20=G18,\"68\",E20=G19,\"72\",E20=G20,\"98\",E20=G21,\"106\",E20=G22,\"126\")","v":""}]
[null,null,null,null,null,null,"Roytronic® Series-A 5-Pin Connector = -106",{"$f":"_xlfn.IFS(E21=\"\",\"\",E21= G6,\"01\",E21=G7,\"02\",E21=G8, \"02\",E21=G9,\"04\",E21=G10,\"06\",E21=G11,\"07\",E21=G12,\"08\",E21=G13,\"09\",E21=G14, \"32\",E21=G15, \"35\",E21=G16,\"40\",E21=G17,\"64\", E21=G18,\"68\",E21=G19,\"72\",E21=G20,\"98\",E21=G21,\"106\",E21=G22,\"126\")","v":""}]
[null,null,null,null,null,null,"Hinged Display Cover = -126",{"$f":"_xlfn.IFS(E22=\"\",\"\",E22= G6,\"01\",E22=G7,\"02\",E22=G8, \"02\",E22=G9,\"04\",E22=G10,\"06\",E22=G11,\"07\",E22=G12,\"08\",E22=G13,\"09\",E22=G14, \"32\",E22=G15, \"35\",E22=G16,\"40\",E22=G17,\"64\", E22=G18,\"68\",E22=G19,\"72\",E22=G20,\"98\",E22=G21,\"106\",E22=G22,\"126\")","v":""}]
[]
[]
[null,null,"Please Select","Please Select",{"$f":"_xlfn.TEXTJOIN(\"-\",TRUE,H6,H7,H8,H9,H10,H11,H12,H13,H14,H15,H16,H17,H18)","v":""}]
[null,"Description","Size","Sensor Material",null,"IP110/IP210","IP150/IP250"]
["Sensor Only","Sensor Only.","3” – 12” pipe = IP110","Brass = B",null,"Rotor with Ceramic Shaft, PVDF Kynar® = -01 ","Rotor with Ceramic Shaft, PVDF Kynar® = -01 "]
[null,null,"12” – 40” pipe = IP210","316 Stainless = S",null,"Brass Adapter Fitting 2 inch NPT = -02","Micropower Pickup -Required for use with FT450 = -04"]
[null,null,"Hot Tap 3” – 12” pipe = IP150 ","PVC  = P",null,"SS Adapter Fitting 2 inch NPT = -02","Standard Power LMI 4-pin Connector = -06"]
[null,null,"Hot Tap 12” – 40” pipe = IP250",null,null,"Micropower Pickup -Required for use with FT450 = -04","Stnd Power Seametrics Ctrl Connector = -07"]
[null,null,null,null,null,"Standard Power LMI 4-pin Connector = -06","316 SS Valve Assembly = -08"]
[null,null,null,null,null,"Stnd Power Seametrics Ctrl Connector = -07","No Valve Assembly = -09"]
[null,null,null,null,{"$f":"_xlfn.IFS(D25=\"B\",F33,D25=\"S\",F34,D25=\"P\",\"\")","v":{"$error":"#N/A"}},"Old Style Adapter 1.5\" NPT = -35","*Immersible = -40"]
[null,null,null,null,null,"*Immersible = -40","Rotor -Kynar®/Silicon Carbide Shaft = -68"]
[null,null,null,null,null,"Rotor -Kynar®/Silicon Carbide Shaft = -68","12” Extension = -72"]
[null,null,null,null,null,"12” Extension = -72","Roytronic® Series-A 5-Pin Connector = -106"]
[null,null,null,null,null,"Roytronic® Series-A 5-Pin Connector = -106"]
[]
[]
[]
[]
[null,"Description","Size","Sensor Material",null,"IP113/IP213","IP153/IP253"]
["FT430 Mounted on Sensor","Rate & total indicator with pulse, externally powered (FT430) mounted on the sensor.","3” – 12” pipe = IP113","Brass = B",null,"Rotor with Ceramic Shaft, PVDF Kynar® = -01 ","Rotor with Ceramic Shaft, PVDF Kynar® = -01 "]
[null,null,"12” – 40” pipe = IP213","316 Stainless = S",{"$f":"_xlfn.IFS(D25=\"B\",F44,D25=\"S\",F45,D25=\"P\",\"\")","v":{"$error":"#N/A"}},"Brass Adapter Fitting 2 inch NPT = -02","316 SS Valve Assembly = -08"]
[null,null,"Hot Tap 3” – 12” pipe = IP153 ","PVC  = P",null,"SS Adapter Fitting 2 inch NPT = -02","No Valve Assembly = -09"]
[null,null,"Hot Tap 12” – 40” pipe = IP253",null,{"$f":"_xlfn.IFS(D25=\"B\",F46,D25=\"S\",F47,D25=\"P\",\"\")","v":{"$error":"#N/A"}},"Tamper Evident Kit = -32","Tamper Evident Kit = -32"]
[null,null,null,null,null,"Old Style Adapter 1.5\" NPT = -35","Non-resettable Total = -64"]
[null,null,null,null,null,"Non-resettable Total = -64","Rotor -Kynar®/Silicon Carbide Shaft = -68"]
[null,null,null,null,null,"Rotor -Kynar®/Silicon Carbide Shaft = -68","12” Extension = -72"]
[null,null,null,null,null,"12” Extension = -72","Dual Relay Output = -98"]
[null,null,null,null,null,"Dual Relay Output = -98","Hinged Display Cover = -126"]
[null,null,null,null,null,"Hinged Display Cover = -126"]
[]
[]
[]
[]
[null,"Description","Size","Sensor Material",null,"IP116/IP216","IP156/IP256"]
["DL76 Mounted on Sensor","Data logger (DL76) mounted on the sensor.","3” – 12” pipe = IP116","Brass = B",null,"Rotor with Ceramic Shaft, PVDF Kynar® = -01 ","Rotor with Ceramic Shaft, PVDF Kynar® = -01 "]
[null,null,"12” – 40” pipe = IP216","316 Stainless = S",{"$f":"_xlfn.IFS(D25=\"B\",F59,D25=\"S\",F60,D25=\"P\",\"\")","v":{"$error":"#N/A"}},"Brass Adapter Fitting 2 inch NPT = -02","316 SS Valve Assembly = -08"]
[null,null,"Hot Tap 3” – 12” pipe = IP156","PVC  = P",null,"SS Adapter Fitting 2 inch NPT = -02","No Valve Assembly = -09"]
[null,null,"Hot Tap 12” – 40” pipe = IP256",null,{"$f":"_xlfn.IFS(D25=\"B\",F61,D25=\"S\",F62,D25=\"P\",\"\")","v":{"$error":"#N/A"}},"Tamper Evident Kit = -32","Tamper Evident Kit = -32"]
[null,null,null,null,null,"Old Style Adapter 1.5\" NPT = -35","Rotor -Kynar®/Silicon Carbide Shaft = -68"]
[null,null,null,null,null,"Rotor -Kynar®/Silicon Carbide Shaft = -68","12” Extension = -72"]
[null,null,null,null,null,"12” Extension = -72"]
[]
[]
[]
[]
[null,"Description","Size","Sensor Material",null,"IP117/IP217","IP157/IP257"]
["FT450 Mounted      on Sensor","Rate & total indicator with pulse, battery powered (FT450) mounted on the sensor.","3” – 12” pipe = IP117","Brass = B",null,"Rotor with Ceramic Shaft, PVDF Kynar® = -01 ","Rotor with Ceramic Shaft, PVDF Kynar® = -01 "]
[null,null,"12” – 40” pipe = IP217","316 Stainless = S",{"$f":"_xlfn.IFS(D25=\"B\",F71,D25=\"S\",F72,D25=\"P\",\"\")","v":{"$error":"#N/A"}},"Brass Adapter Fitting 2 inch NPT = -02","316 SS Valve Assembly = -08"]
[null,null,"Hot Tap 3” – 12” pipe = IP157","PVC  = P",null,"SS Adapter Fitting 2 inch NPT = -02","No Valve Assembly = -09"]
[null,null,"Hot Tap 12” – 40” pipe = IP257",null,{"$f":"_xlfn.IFS(D25=\"B\",F73,D25=\"S\",F74,D25=\"P\",\"\")","v":{"$error":"#N/A"}},"Tamper Evident Kit = -32","Tamper Evident Kit = -32"]
[null,null,null,null,null,"Old Style Adapter 1.5\" NPT = -35","Non-resettable Total = -64"]
[null,null,null,null,null,"Non-resettable Total = -64","Rotor -Kynar®/Silicon Carbide Shaft = -68"]
[null,null,null,null,null,"Rotor -Kynar®/Silicon Carbide Shaft = -68","12” Extension = -72"]
[null,null,null,null,null,"12” Extension = -72","Hinged Display Cover = -126"]
[null,null,null,null,null,"Hinged Display Cover = -126"]
[]
[]
[]
[]
[null,"Description","Size","Sensor Material",null,"IP119/IP219","IP159/IP259"]
["FT440 Mounted          on Sensor","Rate & total indicator with pulse & 4-20 mA output, loop powered (FT440) mounted on the sensor.","3” – 12” pipe = IP119","Brass = B",null,"Rotor with Ceramic Shaft, PVDF Kynar® = -01 ","Rotor with Ceramic Shaft, PVDF Kynar® = -01 "]
[null,null,"12” – 40” pipe = IP219","316 Stainless = S",{"$f":"_xlfn.IFS(D25=\"B\",F85,D25=\"S\",F86,D25=\"P\",\"\")","v":{"$error":"#N/A"}},"Brass Adapter Fitting 2 inch NPT = -02","316 SS Valve Assembly = -08"]
[null,null,"Hot Tap 3” – 12” pipe = IP159","PVC  = P",null,"SS Adapter Fitting 2 inch NPT = -02","No Valve Assembly = -09"]
[null,null,"Hot Tap 12” – 40” pipe = IP259",null,{"$f":"_xlfn.IFS(D25=\"B\",F87,D25=\"S\",F88,D25=\"P\",\"\")","v":{"$error":"#N/A"}},"Tamper Evident Kit = -32","Tamper Evident Kit = -32"]
[null,null,null,null,null,"Old Style Adapter 1.5\" NPT = -35","Non-resettable Total = -64"]
[null,null,null,null,null,"Non-resettable Total = -64","Rotor -Kynar®/Silicon Carbide Shaft = -68"]
[null,null,null,null,null,"Rotor -Kynar®/Silicon Carbide Shaft = -68","12” Extension = -72"]
[null,null,null,null,null,"12” Extension = -72","Dual Relay Output = -98"]
[null,null,null,null,null,"Dual Relay Output = -98","Hinged Display Cover = -126"]
[null,null,null,null,null,"Hinged Display Cover = -126"]
[]
[]
[]
[]
["EX110/210 Series Saddle Fittings"]
["Model #",null,"Description",null,null,null,"Price"]
["MF101F-300-150",null,"Saddle, Iron, NPT Thread, 3\" X 1-1/2\" (3.45 - 4.05 O.D. range)",null,null,null,{"$f":"'Cost Data'!D202","v":378}]
["MF101F-400-150",null,"Saddle, Iron, NPT Thread, 4\" X 1-1/2\" (4.00 - 4.50 O.D. range)","Saddle, Iron, NPT Thread, 4\" X 1-1/2\" (4.00 - 4.50 O.D. range)","Saddle, Iron, NPT Thread, 4\" X 1-1/2\" (4.00 - 4.50 O.D. range)","Saddle, Iron, NPT Thread, 4\" X 1-1/2\" (4.00 - 4.50 O.D. range)",{"$f":"'Cost Data'!D203","v":231}]
["MF101F-600-150",null,"Saddle, Iron, NPT Thread, 6\" X 1-1/2\" (6.00 - 6.63 O.D. range)","Saddle, Iron, NPT Thread, 6\" X 1-1/2\" (6.00 - 6.63 O.D. range)","Saddle, Iron, NPT Thread, 6\" X 1-1/2\" (6.00 - 6.63 O.D. range)","Saddle, Iron, NPT Thread, 6\" X 1-1/2\" (6.00 - 6.63 O.D. range)",{"$f":"'Cost Data'!D204","v":238}]
["MF101F-800-150",null,"Saddle, Iron, NPT Thread, 8\" X 1-1/2\" (8.00 - 8.63 O.D. range)","Saddle, Iron, NPT Thread, 8\" X 1-1/2\" (8.00 - 8.63 O.D. range)","Saddle, Iron, NPT Thread, 8\" X 1-1/2\" (8.00 - 8.63 O.D. range)","Saddle, Iron, NPT Thread, 8\" X 1-1/2\" (8.00 - 8.63 O.D. range)",{"$f":"'Cost Data'!D205","v":285}]
["MF101F-1000-150",null,"Saddle, Iron, NPT Thread, 10\" X 1-1/2\" (10.00 - 11.10 O.D. range) ","Saddle, Iron, NPT Thread, 10\" X 1-1/2\" (10.00 - 11.10 O.D. range) ","Saddle, Iron, NPT Thread, 10\" X 1-1/2\" (10.00 - 11.10 O.D. range) ","Saddle, Iron, NPT Thread, 10\" X 1-1/2\" (10.00 - 11.10 O.D. range) ",{"$f":"'Cost Data'!D206","v":397}]
["MF101F-1200-150",null,"Saddle, Iron, NPT Thread, 12\" X 1-1/2\" (12.00 - 13.20 O.D. range) ","Saddle, Iron, NPT Thread, 12\" X 1-1/2\" (12.00 - 13.20 O.D. range) ","Saddle, Iron, NPT Thread, 12\" X 1-1/2\" (12.00 - 13.20 O.D. range) ","Saddle, Iron, NPT Thread, 12\" X 1-1/2\" (12.00 - 13.20 O.D. range) ",{"$f":"'Cost Data'!D207","v":491}]
["MF101F-1400-150",null,"Saddle, Iron, NPT Thread, 14\" X 1-1/2\" (15.30 - 16.80 O.D. range) ","Saddle, Iron, NPT Thread, 14\" X 1-1/2\" (15.30 - 16.80 O.D. range) ","Saddle, Iron, NPT Thread, 14\" X 1-1/2\" (15.30 - 16.80 O.D. range) ","Saddle, Iron, NPT Thread, 14\" X 1-1/2\" (15.30 - 16.80 O.D. range) ",{"$f":"'Cost Data'!D208","v":702}]
["MF101F-1600-150",null,"Saddle, Iron, NPT Thread, 16\" X 1-1/2\"(17.40 - 18.90 O.D. range) ","Saddle, Iron, NPT Thread, 16\" X 1-1/2\"(17.40 - 18.90 O.D. range) ","Saddle, Iron, NPT Thread, 16\" X 1-1/2\"(17.40 - 18.90 O.D. range) ","Saddle, Iron, NPT Thread, 16\" X 1-1/2\"(17.40 - 18.90 O.D. range) ",{"$f":"'Cost Data'!D209","v":756}]
["MF101F-1800-150",null,"Saddle, Iron, NPT Thread, 18\" X 1-1/2\"(19.50 - 21.10 O.D. range) ","Saddle, Iron, NPT Thread, 18\" X 1-1/2\"(19.50 - 21.10 O.D. range) ","Saddle, Iron, NPT Thread, 18\" X 1-1/2\"(19.50 - 21.10 O.D. range) ","Saddle, Iron, NPT Thread, 18\" X 1-1/2\"(19.50 - 21.10 O.D. range) ",{"$f":"'Cost Data'!D210","v":992}]
["MF101F-2000-150",null,"Saddle, Iron, NPT Thread, 20\" X 1-1/2\"(21.10 - 22.70 O.D. range) ","Saddle, Iron, NPT Thread, 20\" X 1-1/2\"(21.10 - 22.70 O.D. range) ","Saddle, Iron, NPT Thread, 20\" X 1-1/2\"(21.10 - 22.70 O.D. range) ","Saddle, Iron, NPT Thread, 20\" X 1-1/2\"(21.10 - 22.70 O.D. range) ",{"$f":"'Cost Data'!D211","v":1235}]
["MF101F-2200-150",null,"Saddle, Iron, NPT Thread, 22\" X 1-1/2\"(22.70 - 24.30 O.D. range) ","Saddle, Iron, NPT Thread, 22\" X 1-1/2\"(22.70 - 24.30 O.D. range) ","Saddle, Iron, NPT Thread, 22\" X 1-1/2\"(22.70 - 24.30 O.D. range) ","Saddle, Iron, NPT Thread, 22\" X 1-1/2\"(22.70 - 24.30 O.D. range) ",{"$f":"'Cost Data'!D212","v":1243}]
["MF101F-2400-150",null,"Saddle, Iron, NPT Thread, 24\" X 1-1/2\"(24.30 - 25.90 O.D. range) ","Saddle, Iron, NPT Thread, 24\" X 1-1/2\"(24.30 - 25.90 O.D. range) ","Saddle, Iron, NPT Thread, 24\" X 1-1/2\"(24.30 - 25.90 O.D. range) ","Saddle, Iron, NPT Thread, 24\" X 1-1/2\"(24.30 - 25.90 O.D. range) ",{"$f":"'Cost Data'!D213","v":1361}]
["MF101B-400-150",null,"Saddle, Brass, NPT Thread 4\" X 1-1/2\"","Saddle, Brass, NPT Thread 4\" X 1-1/2\"","Saddle, Brass, NPT Thread 4\" X 1-1/2\"","Saddle, Brass, NPT Thread 4\" X 1-1/2\"",{"$f":"'Cost Data'!D214","v":450}]
[]
["EX150/250 Series Saddle Fittings"]
["Model #",null,"Description",null,null,null,"Price"]
["MF101F-300-200",null,"Saddle, Iron, NPT Thread, 3\" X 2\" (3.45 - 4.05 O.D. range)",null,null,null,{"$f":"'Cost Data'!D216","v":378}]
["MF101F-400-200",null,"Saddle, Iron, NPT Thread, 4\" X 2\" (4.00 - 4.50 O.D. range)",null,null,null,{"$f":"'Cost Data'!D217","v":231}]
["MF101F-600-200",null,"Saddle, Iron, NPT Thread, 6\" X 2\" (6.00 - 6.63 O.D. range)",null,null,null,{"$f":"'Cost Data'!D218","v":238}]
["MF101F-800-200",null,"Saddle, Iron, NPT Thread, 8\" X 2\" (8.00 - 8.63 O.D. range)",null,null,null,{"$f":"'Cost Data'!D219","v":285}]
["MF101F-1000-200",null,"Saddle, Iron, NPT Thread, 10\" X 2\" (10.00 - 11.10 O.D. range)",null,null,null,{"$f":"'Cost Data'!D220","v":397}]
["MF101F-1200-200",null,"Saddle, Iron, NPT Thread, 12\" X 2\" (12.00 - 13.20 O.D. range)",null,null,null,{"$f":"'Cost Data'!D221","v":491}]
["MF101F-1400-200",null,"Saddle, Iron, NPT Thread, 14\" X 2\" (15.30 - 16.80 O.D. range)",null,null,null,{"$f":"'Cost Data'!D222","v":702}]
["MF101F-1600-200",null,"Saddle, Iron, NPT Thread, 16\" X 2\"(17.40 - 18.90 O.D. range)",null,null,null,{"$f":"'Cost Data'!D223","v":756}]
["MF101F-1800-200",null,"Saddle, Iron, NPT Thread, 18\" X 2\"(19.50 - 21.10 O.D. range)",null,null,null,{"$f":"'Cost Data'!D224","v":992}]
["MF101F-2000-200",null,"Saddle, Iron, NPT Thread, 20\" X 2\"(21.10 - 22.70 O.D. range)",null,null,null,{"$f":"'Cost Data'!D225","v":1188}]
["MF101F-2200-200",null,"Saddle, Iron, NPT Thread, 22\" X 2\"(22.70 - 24.30 O.D. range)",null,null,null,{"$f":"'Cost Data'!D226","v":1243}]
["MF101F-2400-200",null,"Saddle, Iron, NPT Thread, 24\" X 2\"(24.30 - 25.90 O.D. range)",null,null,null,{"$f":"'Cost Data'!D227","v":1361}]
["MF101B-300-200",null,"Saddle, Brass, NPT Thread, 3\" X 2\" ",null,null,null,{"$f":"'Cost Data'!D228","v":455}]
["MF101B-400-200",null,"Saddle, Brass, NPT Thread, 4\" X 2\" ",null,null,null,{"$f":"'Cost Data'!D229","v":520}]
[]
["EX110/210 Series Parts & Accessories"]
["Model #",null,"Description",null,null,null,"Price"]
[101850,null,"Strain Relief Kit Large, 1/2\", NPT",null,null,null,{"$f":"'Cost Data'!D231","v":21}]
[100411,null,"Gasket, Upper Housing ",null,null,null,{"$f":"'Cost Data'!D232","v":16}]
[102021,102021,"Hinged Display Cover Kit","Hinged Display Cover Kit","Hinged Display Cover Kit","Hinged Display Cover Kit",{"$f":"'Cost Data'!D233","v":64}]
[100662,100662,"Housing Assy, Upper, Blind (Gasket, Screws, Washers, Label) ","Housing Assy, Upper, Blind (Gasket, Screws, Washers, Label) ","Housing Assy, Upper, Blind (Gasket, Screws, Washers, Label) ","Housing Assy, Upper, Blind (Gasket, Screws, Washers, Label) ",{"$f":"'Cost Data'!D234","v":63}]
[103702,103702,"White Housing Screw/Washer Kit","White Housing Screw/Washer Kit","White Housing Screw/Washer Kit","White Housing Screw/Washer Kit",{"$f":"'Cost Data'!D235","v":4}]
[100414,100414,"Screw/Washer Kit, Upper Housing (Qty 4)","Screw/Washer Kit, Upper Housing (Qty 4)","Screw/Washer Kit, Upper Housing (Qty 4)","Screw/Washer Kit, Upper Housing (Qty 4)",{"$f":"'Cost Data'!D236","v":3}]
[100853,100853,"Security Seal, w/12\" of Wire ","Security Seal, w/12\" of Wire ","Security Seal, w/12\" of Wire ","Security Seal, w/12\" of Wire ",{"$f":"'Cost Data'!D237","v":5}]
[100854,100854,"Wire, for Security Seal, 12\" (For 3\" Only)","Wire, for Security Seal, 12\" (For 3\" Only)","Wire, for Security Seal, 12\" (For 3\" Only)","Wire, for Security Seal, 12\" (For 3\" Only)",{"$f":"'Cost Data'!D238","v":3}]
[]
["EX150/250 Series Parts & Accessories"]
["Model #",null,"Description",null,null,null,"Price"]
[101850,101850,"Strain Relief Kit Large, 1/2\", NPT","Strain Relief Kit Large, 1/2\", NPT","Strain Relief Kit Large, 1/2\", NPT","Strain Relief Kit Large, 1/2\", NPT",{"$f":"'Cost Data'!D240","v":21}]
[100411,100411,"Gasket, Upper Housing ","Gasket, Upper Housing ","Gasket, Upper Housing ","Gasket, Upper Housing ",{"$f":"'Cost Data'!D241","v":16}]
[102021,102021,"Hinged Display Cover Kit","Hinged Display Cover Kit","Hinged Display Cover Kit","Hinged Display Cover Kit",{"$f":"'Cost Data'!D242","v":64}]
[100662,100662,"Housing Assy, Upper, Blind (Gasket, Screws, Washers, Label)","Housing Assy, Upper, Blind (Gasket, Screws, Washers, Label)","Housing Assy, Upper, Blind (Gasket, Screws, Washers, Label)","Housing Assy, Upper, Blind (Gasket, Screws, Washers, Label)",{"$f":"'Cost Data'!D243","v":63}]
[103702,103702,"White Housing Screw/Washer Kit","White Housing Screw/Washer Kit","White Housing Screw/Washer Kit","White Housing Screw/Washer Kit",{"$f":"'Cost Data'!D244","v":4}]
[100345,100345,"O-Ring, EPDM, Black","O-Ring, EPDM, Black","O-Ring, EPDM, Black","O-Ring, EPDM, Black",{"$f":"'Cost Data'!D245","v":17}]
[100414,100414,"Screw/Washer Kit, Upper Housing (Qty 4) ","Screw/Washer Kit, Upper Housing (Qty 4) ","Screw/Washer Kit, Upper Housing (Qty 4) ","Screw/Washer Kit, Upper Housing (Qty 4) ",{"$f":"'Cost Data'!D246","v":3}]
[100853,100853,"Security Seal, w/12\" of Wire ","Security Seal, w/12\" of Wire ","Security Seal, w/12\" of Wire ","Security Seal, w/12\" of Wire ",{"$f":"'Cost Data'!D247","v":5}]
[100069,100069,"Valve Assembly, Brass, Hot-Tap ","Valve Assembly, Brass, Hot-Tap ","Valve Assembly, Brass, Hot-Tap ","Valve Assembly, Brass, Hot-Tap ",{"$f":"'Cost Data'!D248","v":299}]
[100119,100119,"Valve Assembly, 316 SS, Hot-Tap","Valve Assembly, 316 SS, Hot-Tap","Valve Assembly, 316 SS, Hot-Tap","Valve Assembly, 316 SS, Hot-Tap",{"$f":"'Cost Data'!D249","v":718}]
[100854,100854,"Wire, for Security Seal, 12\" (For 3\" Only)","Wire, for Security Seal, 12\" (For 3\" Only)","Wire, for Security Seal, 12\" (For 3\" Only)","Wire, for Security Seal, 12\" (For 3\" Only)",{"$f":"'Cost Data'!D250","v":3}]
[100066,100066,"Nipple, Close, Thd, Brass, 2\" ","Nipple, Close, Thd, Brass, 2\" ","Nipple, Close, Thd, Brass, 2\" ","Nipple, Close, Thd, Brass, 2\" ",{"$f":"'Cost Data'!D251","v":81}]
[100103,100103,"Nipple, Close, 316 SS, 2\"","Nipple, Close, 316 SS, 2\"","Nipple, Close, 316 SS, 2\"","Nipple, Close, 316 SS, 2\"",{"$f":"'Cost Data'!D252","v":97}]
["Cables & Connectors"]
["Model #",null,"Description",null,null,null,"Price"]
[100852,null,"Cable, Shielded, 4-Con, EX W/O Reverse Flow (Per Ft.)",null,null,null,{"$f":"'Cost Data'!D898","v":5}]
[100835,null,"Cable, Shielded, 6-Con, EX W/ Reverse Flow (Per Ft.)",null,null,null,{"$f":"'Cost Data'!D899","v":6}]
[100010,null,"Cable, Unshielded, 2 Con, MJ-WJ-AO55 (Per Ft.)",null,null,null,{"$f":"'Cost Data'!D900","v":3}]
[100451,null,"Cable, Unshielded, 3 Con, Blue, Low Power, IP-TX-WT-S Series (Per Ft.)",null,null,null,{"$f":"'Cost Data'!D901","v":3}]
[100011,null,"Cable, Unshielded, 3 Con, Grey Micropower (IP,TX,WT,SPX,SPT,SES)",null,null,null,{"$f":"'Cost Data'!D902","v":3}]
[100014,null,"Cable, Unshielded, 4 Con, FT440, (Per Ft.)",null,null,null,{"$f":"'Cost Data'!D903","v":4}]
[100649,null,"Cable, Unshielded, 3 Con, MJE (Per Ft.)",null,null,null,{"$f":"'Cost Data'!D904","v":3}]
[100008,null,"Connector, Female, LMI 4pin, Female",null,null,null,{"$f":"'Cost Data'!D905","v":40}]
[100006,null,"Connector, Seametrics 3-Pin BulkHead",null,null,null,{"$f":"'Cost Data'!D906","v":40}]
[100007,null,"Connector, Seametrics 3-Pin Cable End",null,null,null,{"$f":"'Cost Data'!D907","v":40}]
[101783,null,"Roytronics® Series-A Pump 5 Pin Connector",null,null,null,{"$f":"'Cost Data'!D908","v":41}]
[]
["Cables & Connectors Assemblies"]
["Model #",null,"Description",null,null,null,"Price"]
[100039,null,"Cable Assy, 12' Unshielded, 2 Con, LMI 4-Pin Connector",null,null,null,{"$f":"'Cost Data'!D910","v":54}]
[100013,null,"Cable Assy, 12' Unshielded, 3 Con, LMI 4-Pin Connector, 1K Resistor","Cable Assy, 12' Unshielded, 3 Con, LMI 4-Pin Connector, 1K Resistor","Cable Assy, 12' Unshielded, 3 Con, LMI 4-Pin Connector, 1K Resistor","Cable Assy, 12' Unshielded, 3 Con, LMI 4-Pin Connector, 1K Resistor",{"$f":"'Cost Data'!D911","v":54}]
[100395,null,"Cable Assy, 12' Unshielded, 2 Con, Seametrics 3-Pin Connector","Cable Assy, 12' Unshielded, 2 Con, Seametrics 3-Pin Connector","Cable Assy, 12' Unshielded, 2 Con, Seametrics 3-Pin Connector","Cable Assy, 12' Unshielded, 2 Con, Seametrics 3-Pin Connector",{"$f":"'Cost Data'!D912","v":54}]
[100041,null,"Cable Assy, 12' Unshielded, 3 Con, Seametrics 3-Pin Connector","Cable Assy, 12' Unshielded, 3 Con, Seametrics 3-Pin Connector","Cable Assy, 12' Unshielded, 3 Con, Seametrics 3-Pin Connector","Cable Assy, 12' Unshielded, 3 Con, Seametrics 3-Pin Connector",{"$f":"'Cost Data'!D913","v":54}]
[101587,null,"Cable Assy, 12' Unshielded, 2 Con, LMI 5-Pin Connector","Cable Assy, 12' Unshielded, 2 Con, LMI 5-Pin Connector","Cable Assy, 12' Unshielded, 2 Con, LMI 5-Pin Connector","Cable Assy, 12' Unshielded, 2 Con, LMI 5-Pin Connector",{"$f":"'Cost Data'!D914","v":54}]
[101576,null,"Cable Assy, 12' Unshielded, 3 Con, LMI 5-Pin Connector","Cable Assy, 12' Unshielded, 3 Con, LMI 5-Pin Connector","Cable Assy, 12' Unshielded, 3 Con, LMI 5-Pin Connector","Cable Assy, 12' Unshielded, 3 Con, LMI 5-Pin Connector",{"$f":"'Cost Data'!D915","v":54}]
[100044,null,"Sensor Assy, MJR, Single Reed Switch, LMI Pump 4-Pin Connector","Sensor Assy, MJR, Single Reed Switch, LMI Pump 4-Pin Connector","Sensor Assy, MJR, Single Reed Switch, LMI Pump 4-Pin Connector","Sensor Assy, MJR, Single Reed Switch, LMI Pump 4-Pin Connector",{"$f":"'Cost Data'!D916","v":113}]
[100045,null,"Sensor Assy, MJR, Dual Reed Switch, LMI Pump 4-Pin Connector","Sensor Assy, MJR, Dual Reed Switch, LMI Pump 4-Pin Connector","Sensor Assy, MJR, Dual Reed Switch, LMI Pump 4-Pin Connector","Sensor Assy, MJR, Dual Reed Switch, LMI Pump 4-Pin Connector",{"$f":"'Cost Data'!D917","v":123}]
[100049,null,"Sensor Assy, MJE, Single Hall Effect, LMI Pump 4-Pin Connector","Sensor Assy, MJE, Single Hall Effect, LMI Pump 4-Pin Connector","Sensor Assy, MJE, Single Hall Effect, LMI Pump 4-Pin Connector","Sensor Assy, MJE, Single Hall Effect, LMI Pump 4-Pin Connector",{"$f":"'Cost Data'!D918","v":113}]
[100046,null,"Sensor Assy, MJR, Single Reed Switch, Seametrics Control Connector","Sensor Assy, MJR, Single Reed Switch, Seametrics Control Connector","Sensor Assy, MJR, Single Reed Switch, Seametrics Control Connector","Sensor Assy, MJR, Single Reed Switch, Seametrics Control Connector",{"$f":"'Cost Data'!D919","v":113}]
[100047,null,"Sensor Assy, MJR, Dual Reed Switch, Seametrics Control Connector","Sensor Assy, MJR, Dual Reed Switch, Seametrics Control Connector","Sensor Assy, MJR, Dual Reed Switch, Seametrics Control Connector","Sensor Assy, MJR, Dual Reed Switch, Seametrics Control Connector",{"$f":"'Cost Data'!D920","v":123}]
[100048,null,"Sensor Assy, MJE, Single Hall Effect, Seametrics Control Cable","Sensor Assy, MJE, Single Hall Effect, Seametrics Control Cable","Sensor Assy, MJE, Single Hall Effect, Seametrics Control Cable","Sensor Assy, MJE, Single Hall Effect, Seametrics Control Cable",{"$f":"'Cost Data'!D921","v":113}]
[101588,null,"Sensor Assy, MJR, Single Reed Switch, LMI Pump 5-Pin Connector","Sensor Assy, MJR, Single Reed Switch, LMI Pump 5-Pin Connector","Sensor Assy, MJR, Single Reed Switch, LMI Pump 5-Pin Connector","Sensor Assy, MJR, Single Reed Switch, LMI Pump 5-Pin Connector",{"$f":"'Cost Data'!D922","v":113}]
[101589,null,"Sensor Assy, MJR, Dual Reed SW, LMI Pump 5-Pin Connector","Sensor Assy, MJR, Dual Reed SW, LMI Pump 5-Pin Connector","Sensor Assy, MJR, Dual Reed SW, LMI Pump 5-Pin Connector","Sensor Assy, MJR, Dual Reed SW, LMI Pump 5-Pin Connector",{"$f":"'Cost Data'!D923","v":113}]
[101590,null,"Sensor Assy, MJE, Single Hall Effect, LMI Pump 5-Pin Connector","Sensor Assy, MJE, Single Hall Effect, LMI Pump 5-Pin Connector","Sensor Assy, MJE, Single Hall Effect, LMI Pump 5-Pin Connector","Sensor Assy, MJE, Single Hall Effect, LMI Pump 5-Pin Connector",{"$f":"'Cost Data'!D924","v":123}]

{"sheet":"IP800","index":12,"n_rows":232,"n_cols":8,"rows_kept":232,"cut":false,"hidden":false,"merged":[[227,0,227,1],[227,2,227,5],[228,0,228,1],[228,2,228,5],[229,0,229,1],[229,2,229,5],[230,0,230,1],[230,2,230,5],[231,0,231,1],[231,2,231,5],[222,0,222,1],[222,2,222,5],[223,0,223,1],[223,2,223,5],[224,0,224,1],[224,2,224,5],[225,0,225,1],[225,2,225,5],[226,0,226,1],[226,2,226,5],[217,0,217,1],[217,2,217,5],[218,0,218,1],[218,2,218,5],[219,0,219,1],[219,2,219,5],[220,0,220,1],[220,2,220,5],[221,0,221,1],[221,2,221,5],[211,0,211,1],[211,2,211,5],[212,0,212,1],[212,2,212,5],[213,0,213,1],[213,2,213,5],[215,0,215,6],[216,0,216,1],[216,2,216,5],[206,0,206,1],[206,2,206,5],[207,0,207,1],[207,2,207,5],[208,0,208,1],[208,2,208,5],[209,0,209,1],[209,2,209,5],[210,0,210,1],[210,2,210,5],[201,0,201,6],[202,0,202,1],[202,2,202,5],[203,0,203,1],[203,2,203,5],[204,0,204,1],[204,2,204,5],[205,0,205,1],[205,2,205,5],[200,0,200,1],[200,2,200,5],[197,0,197,1],[197,2,197,5],[198,0,198,1],[198,2,198,5],[199,0,199,1],[199,2,199,5],[194,0,194,1],[194,2,194,5],[195,0,195,1],[195,2,195,5],[196,0,196,1],[196,2,196,5],[191,0,191,1],[191,2,191,5],[192,0,192,1],[192,2,192,5],[193,0,193,1],[193,2,193,5],[188,0,188,1],[188,2,188,5],[189,0,189,1],[189,2,189,5],[190,0,190,1],[190,2,190,5],[185,0,185,1],[185,2,185,5],[186,0,186,1],[186,2,186,5],[187,0,187,1],[187,2,187,5],[182,0,182,1],[182,2,182,5],[183,0,183,1],[183,2,183,5],[184,0,184,1],[184,2,184,5],[179,0,179,1],[179,2,179,5],[180,0,180,1],[180,2,180,5],[181,0,181,1],[181,2,181,5],[164,0,164,1],[164,2,164,5],[165,0,165,1],[165,2,165,5],[173,0,173,1],[174,0,174,1],[173,2,173,5],[174,2,174,5],[177,0,177,6],[178,0,178,1],[178,2,178,5],[172,0,172,1],[172,2,172,5],[175,0,175,1],[175,2,175,5],[176,0,176,1],[176,2,176,5],[169,0,169,1],[133,0,133,6],[141,2,141,5],[144,0,144,1],[144,2,144,5],[145,0,145,1],[145,2,145,5],[97,2,97,5],[98,2,98,5],[99,2,99,5],[100,2,100,5],[101,2,101,5],[108,2,108,5],[97,0,97,1],[98,0,98,1],[99,0,99,1],[100,0,100,1],[101,0,101,1],[108,0,108,1],[127,0,127,1],[127,2,127,5],[113,0,113,1],[113,2,113,5],[114,0,114,1],[114,2,114,5],[126,0,126,1],[126,2,126,5],[121,0,121,1],[121,2,121,5],[122,0,122,1],[122,2,122,5],[123,0,123,1],[123,2,123,5],[118,0,118,1],[118,2,118,5],[119,0,119,1],[119,2,119,5],[120,0,120,1],[120,2,120,5],[105,0,105,1],[105,2,105,5],[106,0,106,1],[106,2,106,5],[107,0,107,1],[107,2,107,5],[115,0,115,1],[115,2,115,5],[124,0,124,1],[124,2,124,5],[102,0,102,1],[102,2,102,5],[103,0,103,1],[103,2,103,5],[104,0,104,1],[104,2,104,5],[93,0,93,1],[93,2,93,5],[94,0,94,1],[94,2,94,5],[95,0,95,1],[95,2,95,5],[96,0,96,1],[96,2,96,5],[90,0,90,1],[90,2,90,5],[91,0,91,1],[91,2,91,5],[92,0,92,1],[92,2,92,5],[35,4,35,6],[58,4,58,6],[89,0,89,1],[89,2,89,5],[51,0,58,0],[51,1,58,1],[86,0,86,1],[86,2,86,5],[87,0,87,1],[87,2,87,5],[88,0,88,1],[88,2,88,5],[83,0,83,1],[83,2,83,5],[84,0,84,1],[84,2,84,5],[85,0,85,1],[85,2,85,5],[55,4,55,6],[56,4,56,6],[57,4,57,6],[59,4,59,6],[50,4,50,6],[51,4,51,6],[52,4,52,6],[53,4,53,6],[54,4,54,6],[169,2,169,5],[170,0,170,1],[170,2,170,5],[171,0,171,1],[171,2,171,5],[166,0,166,1],[166,2,166,5],[167,0,167,1],[167,2,167,5],[168,0,168,1],[168,2,168,5],[161,0,161,1],[161,2,161,5],[162,0,162,1],[162,2,162,5],[163,0,163,1],[163,2,163,5],[159,0,159,1],[159,2,159,5],[160,0,160,1],[160,2,160,5],[157,0,157,1],[157,2,157,5],[158,0,158,1],[158,2,158,5],[154,0,154,1],[154,2,154,5],[155,0,155,1],[155,2,155,5],[156,0,156,1],[156,2,156,5],[152,0,152,6],[153,0,153,1],[153,2,153,5],[150,0,150,1],[150,2,150,5],[151,0,151,1],[151,2,151,5],[147,0,147,1],[147,2,147,5],[148,0,148,1],[148,2,148,5],[149,0,149,1],[149,2,149,5],[142,0,142,1],[142,2,142,5],[143,0,143,1],[143,2,143,5],[146,0,146,1],[146,2,146,5],[140,0,140,1],[140,2,140,5],[141,0,141,1],[137,0,137,1],[137,2,137,5],[138,0,138,1],[138,2,138,5],[139,0,139,1],[139,2,139,5],[134,0,134,1],[134,2,134,5],[135,0,135,1],[135,2,135,5],[136,0,136,1],[136,2,136,5],[130,0,130,1],[130,2,130,5],[131,0,131,1],[131,2,131,5],[132,0,132,1],[132,2,132,5],[109,0,109,1],[109,2,109,5],[128,0,128,1],[128,2,128,5],[129,0,129,1],[129,2,129,5],[110,0,110,1],[110,2,110,5],[111,0,111,1],[111,2,111,5],[112,0,112,1],[112,2,112,5],[116,0,116,1],[116,2,116,5],[117,0,117,1],[117,2,117,5],[125,0,125,1],[125,2,125,5],[80,0,80,1],[80,2,80,5],[81,0,81,1],[81,2,81,5],[82,0,82,1],[82,2,82,5],[77,0,77,1],[77,2,77,5],[78,0,78,1],[78,2,78,5],[79,0,79,1],[79,2,79,5],[74,0,74,1],[74,2,74,5],[75,0,75,1],[75,2,75,5],[76,0,76,1],[76,2,76,5],[66,4,66,6],[67,4,67,6],[68,4,68,6],[72,0,72,6],[73,0,73,1],[73,2,73,5],[60,0,69,0],[60,4,60,6],[61,1,69,1],[61,4,61,6],[62,4,62,6],[63,4,63,6],[64,4,64,6],[65,4,65,6],[42,0,48,0],[42,1,48,1],[42,4,42,6],[43,4,43,6],[44,4,44,6],[45,4,45,6],[46,4,46,6],[28,4,28,6],[30,4,30,6],[31,0,39,0],[31,1,39,1],[31,4,31,6],[32,4,32,6],[33,4,33,6],[34,4,34,6],[36,4,36,6],[37,4,37,6],[47,4,47,6],[48,4,48,6],[38,4,38,6],[39,4,39,6],[41,4,41,6],[0,5,0,6],[2,3,2,5],[18,4,18,6],[19,0,28,0],[19,1,28,1],[19,4,19,6],[25,4,25,6],[26,4,26,6],[27,4,27,6],[20,4,20,6],[21,4,21,6],[22,4,22,6],[23,4,23,6],[24,4,24,6]]}
[null,{"$f":"_xlfn.TEXTJOIN(\"\",TRUE,C18,D18)","v":"Please SelectPlease Select"},{"$f":"E18","v":""},null,null,{"$f":"_xlfn.TEXTJOIN(\"-\",TRUE,B1,C1)","v":"Please SelectPlease Select"}]
[null,"Meter","Options"]
["Costs",{"$f":"_xlfn.IFS(B1=\"IP810B\",'Cost Data'!D457, B1=\"IP810P\",'Cost Data'!D458, B1=\"IP810S\",'Cost Data'!D459, B1=\"IP810Y\",'Cost Data'!D460, B1=\"IP810S-HP\",'Cost Data'!D461, B1=\"IP820B\",'Cost Data'!D462, B1=\"IP820P\",'Cost Data'!D463, B1=\"IP820S\",'Cost Data'!D464, B1=\"IP820Y\",'Cost Data'!D465, B1=\"IP820S-HP\",'Cost Data'!D466,B1=\"IP813B\",'Cost Data'!D467, B1=\"IP813P\",'Cost Data'!D468, B1=\"IP813S\",'Cost Data'!D469, B1=\"IP813Y\",'Cost Data'!D470, B1=\"IP813S-HP\",'Cost Data'!D471, B1=\"IP823B\",'Cost Data'!D472, B1=\"IP823P\",'Cost Data'!D473, B1=\"IP823S\",'Cost Data'!D474, B1=\"IP823Y\",'Cost Data'!D475, B1=\"IP823S-HP\",'Cost Data'!D476, B1=\"IP816B\",'Cost Data'!D477, B1=\"IP816P\",'Cost Data'!D478, B1=\"IP816S\",'Cost Data'!D479, B1=\"IP816Y\",'Cost Data'!D480, B1=\"IP816S-HP\",'Cost Data'!D481, B1=\"IP826B\",'Cost Data'!D482, B1=\"IP826P\",'Cost Data'!D483, B1=\"IP826S\",'Cost Data'!D484, B1=\"IP826Y\",'Cost Data'!D485, B1=\"IP826S-HP\",'Cost Data'!D486, B1=\"IP817B\",'Cost Data'!D487, B1=\"IP817P\",'Cost Data'!D488, B1=\"IP817S\",'Cost Data'!D489, B1=\"IP817Y\",'Cost Data'!D490, B1=\"IP817S-HP\",'Cost Data'!D491, B1=\"IP827B\",'Cost Data'!D492, B1=\"IP827P\",'Cost Data'!D493, B1=\"IP827S\",'Cost Data'!D494, B1=\"IP827Y\",'Cost Data'!D495, B1=\"IP827S-HP\",'Cost Data'!D496, B1=\"IP819B\",'Cost Data'!D497, B1=\"IP819P\",'Cost Data'!D498, B1=\"IP819S\",'Cost Data'!D499, B1=\"IP819Y\",'Cost Data'!D500, B1=\"IP819S-HP\",'Cost Data'!D501, B1=\"IP829B\",'Cost Data'!D502, B1=\"IP829P\",'Cost Data'!D503, B1=\"IP829S\",'Cost Data'!D494, B1=\"IP829Y\",'Cost Data'!D505, B1=\"IP829S-HP\",'Cost Data'!D506)","v":{"$error":"#N/A"}},{"$f":"SUM(C5:C17)","v":0},"Total",null,null,{"$f":"B3+C3","v":{"$error":"#N/A"}}]
[null,null,null,null,null,"Available Options","All Options"]
[null,null,{"$f":"_xlfn.IFS(E5=\"\",0,E5=$G$5,'Cost Data'!$D$507,E5=$G$6,'Cost Data'!$D$508,E5=$G$7,'Cost Data'!$D$509,E5=$G$8,'Cost Data'!$D$510,E5=$G$9,'Cost Data'!$D$511,E5=$G$10,'Cost Data'!$D$512,E5=$G$11,'Cost Data'!$D$513,E5=$G$12,'Cost Data'!$D$514,E5=$G$13,'Cost Data'!$D$515,E5=$G$14,'Cost Data'!$D$516,E5=$G$15,'Cost Data'!$D$517,E5=$G$16,'Cost Data'!$D$518)","v":0},"Option 1",null,{"$f":"_xlfn.IFS(C18=\"\",\"#N/A\",C18<>\"Please Select\",G5,C18=\"Please Select\", \"\")","v":""},"Rotor w/ Ceramic Shaft, PVDF, Kynar = -01",{"$f":"_xlfn.IFS(E5=\"\",\"\",E5=$G$5,\"01\",E5=$G$6,\"04\",E5=$G$7,\"06\",E5=$G$8,\"07\",E5=$G$9,32,E5=$G$10,40,E5=$G$11,60,E5=$G$12,64,E5=$G$13,68,E5=$G$14,98,E5=$G$15,106,E5=$G$16,126)","v":""}]
[null,null,{"$f":"_xlfn.IFS(E6=\"\",0,E6=$G$5,'Cost Data'!$D$507,E6=$G$6,'Cost Data'!$D$508,E6=$G$7,'Cost Data'!$D$509,E6=$G$8,'Cost Data'!$D$510,E6=$G$9,'Cost Data'!$D$511,E6=$G$10,'Cost Data'!$D$512,E6=$G$11,'Cost Data'!$D$513,E6=$G$12,'Cost Data'!$D$514,E6=$G$13,'Cost Data'!$D$515,E6=$G$14,'Cost Data'!$D$516,E6=$G$15,'Cost Data'!$D$517,E6=$G$16,'Cost Data'!$D$518)","v":0},"Option 2",null,{"$f":"_xlfn.IFS(C18=\"IP810\",E22,C18=\"IP820\",E22,C18=\"IP813\",E34,C18=\"IP823\",E34,C18=\"IP816\",E45,C18=\"IP826\",E45,C18=\"IP817\",E54,C18=\"IP827\",E54,C18=\"IP819\",E64,C18=\"IP829\",E64,C18=\"Please Select\", \"\")","v":""},"Micropower Pickup = -04",{"$f":"_xlfn.IFS(E6=\"\",\"\",E6=$G$5,\"01\",E6=$G$6,\"04\",E6=$G$7,\"06\",E6=$G$8,\"07\",E6=$G$9,32,E6=$G$10,40,E6=$G$11,60,E6=$G$12,64,E6=$G$13,68,E6=$G$14,98,E6=$G$15,106,E6=$G$16,126)","v":""}]
[null,null,{"$f":"_xlfn.IFS(E7=\"\",0,E7=$G$5,'Cost Data'!$D$507,E7=$G$6,'Cost Data'!$D$508,E7=$G$7,'Cost Data'!$D$509,E7=$G$8,'Cost Data'!$D$510,E7=$G$9,'Cost Data'!$D$511,E7=$G$10,'Cost Data'!$D$512,E7=$G$11,'Cost Data'!$D$513,E7=$G$12,'Cost Data'!$D$514,E7=$G$13,'Cost Data'!$D$515,E7=$G$14,'Cost Data'!$D$516,E7=$G$15,'Cost Data'!$D$517,E7=$G$16,'Cost Data'!$D$518)","v":0},"Option 3",null,{"$f":"_xlfn.IFS(C18=\"IP810\",E23,C18=\"IP820\",E23,C18=\"IP813\",E35,C18=\"IP823\",E35,C18=\"IP816\",E46,C18=\"IP826\",E46,C18=\"IP817\",E55,C18=\"IP827\",E55,C18=\"IP819\",E65,C18=\"IP829\",E65,C18=\"Please Select\", \"\")","v":""},"Standard Power, LMI 4-pin Connector = -06",{"$f":"_xlfn.IFS(E7=\"\",\"\",E7=$G$5,\"01\",E7=$G$6,\"04\",E7=$G$7,\"06\",E7=$G$8,\"07\",E7=$G$9,32,E7=$G$10,40,E7=$G$11,60,E7=$G$12,64,E7=$G$13,68,E7=$G$14,98,E7=$G$15,106,E7=$G$16,126)","v":""}]
[null,null,{"$f":"_xlfn.IFS(E8=\"\",0,E8=$G$5,'Cost Data'!$D$507,E8=$G$6,'Cost Data'!$D$508,E8=$G$7,'Cost Data'!$D$509,E8=$G$8,'Cost Data'!$D$510,E8=$G$9,'Cost Data'!$D$511,E8=$G$10,'Cost Data'!$D$512,E8=$G$11,'Cost Data'!$D$513,E8=$G$12,'Cost Data'!$D$514,E8=$G$13,'Cost Data'!$D$515,E8=$G$14,'Cost Data'!$D$516,E8=$G$15,'Cost Data'!$D$517,E8=$G$16,'Cost Data'!$D$518)","v":0},"Option 4",null,{"$f":"_xlfn.IFS(C18=\"IP810\",E24,C18=\"IP820\",E24,C18=\"IP813\",E36,C18=\"IP823\",E36,C18=\"IP816\",E47,C18=\"IP826\",E47,C18=\"IP817\",E56,C18=\"IP827\",E56,C18=\"IP819\",E66,C18=\"IP829\",E66,C18=\"Please Select\", \"\")","v":""},"Stnd Power, Seametrics Ctrl Connector = -07",{"$f":"_xlfn.IFS(E8=\"\",\"\",E8=$G$5,\"01\",E8=$G$6,\"04\",E8=$G$7,\"06\",E8=$G$8,\"07\",E8=$G$9,32,E8=$G$10,40,E8=$G$11,60,E8=$G$12,64,E8=$G$13,68,E8=$G$14,98,E8=$G$15,106,E8=$G$16,126)","v":""}]
[null,null,{"$f":"_xlfn.IFS(E9=\"\",0,E9=$G$5,'Cost Data'!$D$507,E9=$G$6,'Cost Data'!$D$508,E9=$G$7,'Cost Data'!$D$509,E9=$G$8,'Cost Data'!$D$510,E9=$G$9,'Cost Data'!$D$511,E9=$G$10,'Cost Data'!$D$512,E9=$G$11,'Cost Data'!$D$513,E9=$G$12,'Cost Data'!$D$514,E9=$G$13,'Cost Data'!$D$515,E9=$G$14,'Cost Data'!$D$516,E9=$G$15,'Cost Data'!$D$517,E9=$G$16,'Cost Data'!$D$518)","v":0},"Option 5",null,{"$f":"_xlfn.IFS(C18=\"IP810\",E25,C18=\"IP820\",E25,C18=\"IP813\",E37,C18=\"IP823\",E37,C18=\"IP816\",\"\",C18=\"IP826\",\"\",C18=\"IP817\",E57,C18=\"IP827\",E57,C18=\"IP819\",E67,C18=\"IP829\",E67,C18=\"Please Select\", \"\")","v":""},"Tamper Evident Kit = -32",{"$f":"_xlfn.IFS(E9=\"\",\"\",E9=$G$5,\"01\",E9=$G$6,\"04\",E9=$G$7,\"06\",E9=$G$8,\"07\",E9=$G$9,32,E9=$G$10,40,E9=$G$11,60,E9=$G$12,64,E9=$G$13,68,E9=$G$14,98,E9=$G$15,106,E9=$G$16,126)","v":""}]
[null,null,{"$f":"_xlfn.IFS(E10=\"\",0,E10=$G$5,'Cost Data'!$D$507,E10=$G$6,'Cost Data'!$D$508,E10=$G$7,'Cost Data'!$D$509,E10=$G$8,'Cost Data'!$D$510,E10=$G$9,'Cost Data'!$D$511,E10=$G$10,'Cost Data'!$D$512,E10=$G$11,'Cost Data'!$D$513,E10=$G$12,'Cost Data'!$D$514,E10=$G$13,'Cost Data'!$D$515,E10=$G$14,'Cost Data'!$D$516,E10=$G$15,'Cost Data'!$D$517,E10=$G$16,'Cost Data'!$D$518)","v":0},"Option 6",null,{"$f":"_xlfn.IFS(C18=\"IP810\",E26,C18=\"IP820\",E26,C18=\"IP813\",E38,C18=\"IP823\",E38,C18=\"IP816\",\"\",C18=\"IP826\",\"\",C18=\"IP817\",\"\",C18=\"IP827\",\"\",C18=\"IP819\",E68,C18=\"IP829\",E68,C18=\"Please Select\", \"\")","v":""},"*Immersible = -40",{"$f":"_xlfn.IFS(E10=\"\",\"\",E10=$G$5,\"01\",E10=$G$6,\"04\",E10=$G$7,\"06\",E10=$G$8,\"07\",E10=$G$9,32,E10=$G$10,40,E10=$G$11,60,E10=$G$12,64,E10=$G$13,68,E10=$G$14,98,E10=$G$15,106,E10=$G$16,126)","v":""}]
[null,null,null,null,null,null,"Viton O-Ring, Brown = -60",{"$f":"_xlfn.IFS(E11=\"\",\"\",E11=$G$5,\"01\",E11=$G$6,\"04\",E11=$G$7,\"06\",E11=$G$8,\"07\",E11=$G$9,32,E11=$G$10,40,E11=$G$11,60,E11=$G$12,64,E11=$G$13,68,E11=$G$14,98,E11=$G$15,106,E11=$G$16,126)","v":""}]
[null,null,null,null,null,null,"Non-resettable Total = 64",{"$f":"_xlfn.IFS(E12=\"\",\"\",E12=$G$5,\"01\",E12=$G$6,\"04\",E12=$G$7,\"06\",E12=$G$8,\"07\",E12=$G$9,32,E12=$G$10,40,E12=$G$11,60,E12=$G$12,64,E12=$G$13,68,E12=$G$14,98,E12=$G$15,106,E12=$G$16,126)","v":""}]
[null,null,null,null,null,null,"Rotor with Kynar/Silicon Carbide Shaft = -68",{"$f":"_xlfn.IFS(E13=\"\",\"\",E13=$G$5,\"01\",E13=$G$6,\"04\",E13=$G$7,\"06\",E13=$G$8,\"07\",E13=$G$9,32,E13=$G$10,40,E13=$G$11,60,E13=$G$12,64,E13=$G$13,68,E13=$G$14,98,E13=$G$15,106,E13=$G$16,126)","v":""}]
[null,null,null,null,null,null,"Dual Relay Output = 98",{"$f":"_xlfn.IFS(E14=\"\",\"\",E14=$G$5,\"01\",E14=$G$6,\"04\",E14=$G$7,\"06\",E14=$G$8,\"07\",E14=$G$9,32,E14=$G$10,40,E14=$G$11,60,E14=$G$12,64,E14=$G$13,68,E14=$G$14,98,E14=$G$15,106,E14=$G$16,126)","v":""}]
[null,null,null,null,null,null,"Roytronic® Series-A 5-Pin Connector = -106",{"$f":"_xlfn.IFS(E15=\"\",\"\",E15=$G$5,\"01\",E15=$G$6,\"04\",E15=$G$7,\"06\",E15=$G$8,\"07\",E15=$G$9,32,E15=$G$10,40,E15=$G$11,60,E15=$G$12,64,E15=$G$13,68,E15=$G$14,98,E15=$G$15,106,E15=$G$16,126)","v":""}]
[null,null,null,null,null,null,"Hinged Display Cover = -126",{"$f":"_xlfn.IFS(E16=\"\",\"\",E16=$G$5,\"01\",E16=$G$6,\"04\",E16=$G$7,\"06\",E16=$G$8,\"07\",E16=$G$9,32,E16=$G$10,40,E16=$G$11,60,E16=$G$12,64,E16=$G$13,68,E16=$G$14,98,E16=$G$15,106,E16=$G$16,126)","v":""}]
[null,null,null,null,null,null,"**High Pressure (Stainless Only) = -HP",{"$f":"_xlfn.IFS(E17=\"\",\"\",E17=$G$5,\"01\",E17=$G$6,\"04\",E17=$G$7,\"06\",E17=$G$8,\"07\",E17=$G$9,32,E17=$G$10,40,E17=$G$11,60,E17=$G$12,64,E17=$G$13,68,E17=$G$14,98,E17=$G$15,106,E17=$G$16,126)","v":""}]
[null,null,"Please Select","Please Select",{"$f":"_xlfn.TEXTJOIN(\"-\",TRUE,H5:H17)","v":""}]
[null,"Description","Size","Sensor Material","Options"]
["Sensor Only","Sensor only","1/2\" - 3” = IP810","Brass = B","Rotor w/ Ceramic Shaft, PVDF, Kynar = -01"]
[null,null,"4\" - 8” = IP820","316 Stainless = S","Micropower Pickup = -04"]
[null,null,null,"PVC  = P","Standard Power, LMI 4-pin Connector = -06"]
[null,null,null,"Polypro = Y","Stnd Power, Seametrics Ctrl Connector = -07"]
[null,null,null,null,"*Immersible = -40"]
[null,null,null,null,"Viton O-Ring, Brown = -60"]
[null,null,null,null,"Rotor with Kynar/Silicon Carbide Shaft = -68"]
[null,null,null,null,"Roytronic® Series-A 5-Pin Connector = -106"]
[null,null,null,null,"**High Pressure (Stainless Only) = -HP"]
[]
[]
[null,"Description","Size","Sensor Material","Options"]
["FT430 Mounted        on Sensor","Rate and total indicator with pulse, externally powered (FT430) mounted on the sensor.","1/2\" - 3” = IP813","Brass = B","Rotor w/ Ceramic Shaft, PVDF, Kynar = -01"]
[null,null,"4\" - 8” = IP823","316 Stainless = S","Tamper Evident Kit = -32"]
[null,null,null,"PVC  = P","Viton O-Ring, Brown = -60"]
[null,null,null,"Polypro = Y","Non-resettable Total = 64"]
[null,null,null,null,"Rotor with Kynar/Silicon Carbide Shaft = -68"]
[null,null,null,null,"Dual Relay Output = 98"]
[null,null,null,null,"Hinged Display Cover = -126"]
[null,null,null,null,"**High Pressure (Stainless Only) = -HP"]
[]
[]
[null,"Description","Size","Sensor Material","Options"]
["DL76 Mounted on Sensor","Data Logger (DL76) mounted on the sensor.","1/2\" - 3” = IP816","Brass = B","Rotor w/ Ceramic Shaft, PVDF, Kynar = -01"]
[null,null,"4\" - 8” = IP826","316 Stainless = S","Micropower Pickup = -04","Tamper Evident Kit = -32","Tamper Evident Kit = -32"]
[null,null,null,"PVC  = P","Tamper Evident Kit = -32","Low Power = -50","Low Power = -50"]
[null,null,null,"Polypro = Y","Viton O-Ring, Brown = -60","Viton O-Ring = -125","Viton O-Ring = -125"]
[null,null,null,null,"Rotor with Kynar/Silicon Carbide Shaft = -68"]
[null,null,null,null,"**High Pressure (Stainless Only) = -HP"]
[]
[]
[null,"Description","Size","Sensor Material","Options"]
["FT450 Mounted        on Sensor","Rate & total indicator with pulse, battery powered (FT450) mounted on the sensor","1/2\" - 3” = IP817","Brass = B","Rotor w/ Ceramic Shaft, PVDF, Kynar = -01"]
[null,null,"4\" - 8” = IP827","316 Stainless = S","Tamper Evident Kit = -32","Tamper Evident Kit = -32","Tamper Evident Kit = -32"]
[null,null,null,"PVC  = P","Viton O-Ring, Brown = -60"]
[null,null,null,"Polypro = Y","Non-resettable Total = 64"]
[null,null,null,null,"Rotor with Kynar/Silicon Carbide Shaft = -68"]
[null,null,null,null,"Hinged Display Cover = -126"]
[null,null,null,null,"**High Pressure (Stainless Only) = -HP"]
[]
[]
["FT440 Mounted        on Sensor","Description","Size","Sensor Material","Options"]
[null,"Rate & total indicator\nwith pulse & 4-20 mA\noutput, loop powered\n(FT440) mounted on the\nsensor.","1/2\" - 3” = IP819","Brass = B","Rotor w/ Ceramic Shaft, PVDF, Kynar = -01"]
[null,null,"4\" - 8” = IP829","316 Stainless = S","Tamper Evident Kit = -32"]
[null,null,null,"PVC  = P","Viton O-Ring, Brown = -60"]
[null,null,null,"Polypro = Y","Non-resettable Total = 64"]
[null,null,null,null,"Rotor with Kynar/Silicon Carbide Shaft = -68"]
[null,null,null,null,"Dual Relay Output = 98"]
[null,null,null,null,"Hinged Display Cover = -126"]
[null,null,null,null,"**High Pressure (Stainless Only) = -HP"]
[]
[]
[]
["IP800 Series Tee Fittings"]
["Model #",null,"Description",null,null,null,"Price"]
[null,null,"Bronze"]
["MF81TC-B-050",null,"Tee Fitting, Bronze, Sweat, 1/2\", IP",null,null,null,{"$f":"'Cost Data'!D521","v":280}]
["MF81TC-B-075","MF81TC-B-075","Tee Fitting, Bronze, Sweat, 3/4\", IP","Tee Fitting, Bronze, Sweat, 3/4\", IP","Tee Fitting, Bronze, Sweat, 3/4\", IP","Tee Fitting, Bronze, Sweat, 3/4\", IP",{"$f":"'Cost Data'!D522","v":292}]
["MF81TC-B-100","MF81TC-B-100","Tee Fitting, Bronze, Sweat, 1\", IP","Tee Fitting, Bronze, Sweat, 1\", IP","Tee Fitting, Bronze, Sweat, 1\", IP","Tee Fitting, Bronze, Sweat, 1\", IP",{"$f":"'Cost Data'!D523","v":319}]
["MF81TC-B-150","MF81TC-B-150","Tee Fitting, Bronze, Sweat, 1-1/2\", IP","Tee Fitting, Bronze, Sweat, 1-1/2\", IP","Tee Fitting, Bronze, Sweat, 1-1/2\", IP","Tee Fitting, Bronze, Sweat, 1-1/2\", IP",{"$f":"'Cost Data'!D524","v":354}]
["MF81TC-B-200","MF81TC-B-200","Tee Fitting, Bronze, Sweat, 2\", IP","Tee Fitting, Bronze, Sweat, 2\", IP","Tee Fitting, Bronze, Sweat, 2\", IP","Tee Fitting, Bronze, Sweat, 2\", IP",{"$f":"'Cost Data'!D525","v":369}]
["MF81TC-B-300","MF81TC-B-300","Tee Fitting, Bronze, Sweat, 3\", IP","Tee Fitting, Bronze, Sweat, 3\", IP","Tee Fitting, Bronze, Sweat, 3\", IP","Tee Fitting, Bronze, Sweat, 3\", IP",{"$f":"'Cost Data'!D526","v":453}]
["MF81TC-B-400","MF81TC-B-400","Tee Fitting, Bronze, Sweat, 4, IP","Tee Fitting, Bronze, Sweat, 4, IP","Tee Fitting, Bronze, Sweat, 4, IP","Tee Fitting, Bronze, Sweat, 4, IP",{"$f":"'Cost Data'!D527","v":768}]
["MF81T-B-050","MF81T-B-050 T","Tee Fitting, Bronze, 1/2\", Threaded, IP","ee Fitting, Bronze, 1/2\", Threaded, IP","ee Fitting, Bronze, 1/2\", Threaded, IP","ee Fitting, Bronze, 1/2\", Threaded, IP",{"$f":"'Cost Data'!D528","v":273}]
["MF81T-B-075","MF81T-B-075 T","Tee Fitting, Bronze, 3/4\", Threaded, IP","ee Fitting, Bronze, 3/4\", Threaded, IP","ee Fitting, Bronze, 3/4\", Threaded, IP","ee Fitting, Bronze, 3/4\", Threaded, IP",{"$f":"'Cost Data'!D529","v":285}]
["MF81T-B-100","MF81T-B-100 T","Tee Fitting, Bronze, 1\", Threaded, IP","ee Fitting, Bronze, 1\", Threaded, IP","ee Fitting, Bronze, 1\", Threaded, IP","ee Fitting, Bronze, 1\", Threaded, IP",{"$f":"'Cost Data'!D530","v":308}]
["MF81T-B-150","MF81T-B-150 T","Tee Fitting, Bronze, 1-1/2\", Threaded, IP","ee Fitting, Bronze, 1-1/2\", Threaded, IP","ee Fitting, Bronze, 1-1/2\", Threaded, IP","ee Fitting, Bronze, 1-1/2\", Threaded, IP",{"$f":"'Cost Data'!D531","v":323}]
["MF81T-B-200","MF81T-B-200 T","Tee Fitting, Bronze, 2\", Threaded, IP","ee Fitting, Bronze, 2\", Threaded, IP","ee Fitting, Bronze, 2\", Threaded, IP","ee Fitting, Bronze, 2\", Threaded, IP",{"$f":"'Cost Data'!D532","v":349}]
["MF81T-B-300","MF81T-B-300 T","Tee Fitting, Bronze, 3\", Threaded, IP","ee Fitting, Bronze, 3\", Threaded, IP","ee Fitting, Bronze, 3\", Threaded, IP","ee Fitting, Bronze, 3\", Threaded, IP",{"$f":"'Cost Data'!D533","v":432}]
["MF81T-B-400","MF81T-B-400 T","Tee Fitting, Bronze, 4\", Threaded, IP","ee Fitting, Bronze, 4\", Threaded, IP","ee Fitting, Bronze, 4\", Threaded, IP","ee Fitting, Bronze, 4\", Threaded, IP",{"$f":"'Cost Data'!D534","v":769}]
[null,null,"PVC"]
["MF81T-P-050",null,"Tee Fitting, PVC, 1/2\", IP, Block Tee",null,null,null,{"$f":"'Cost Data'!D535","v":144}]
["MF81T-P-075","MF81T-P-075","Tee Fitting, PVC, 3/4\", IP, Block Tee","Tee Fitting, PVC, 3/4\", IP, Block Tee","Tee Fitting, PVC, 3/4\", IP, Block Tee","Tee Fitting, PVC, 3/4\", IP, Block Tee",{"$f":"'Cost Data'!D536","v":154}]
["MF81T-P-100","MF81T-P-100","Tee Fitting, PVC, 1\", IP, Block Tee","Tee Fitting, PVC, 1\", IP, Block Tee","Tee Fitting, PVC, 1\", IP, Block Tee","Tee Fitting, PVC, 1\", IP, Block Tee",{"$f":"'Cost Data'!D537","v":161}]
["MF81T-P-150","MF81T-P-150","Tee Fitting, PVC, 1-1/2\", IP, Pipe Stub","Tee Fitting, PVC, 1-1/2\", IP, Pipe Stub","Tee Fitting, PVC, 1-1/2\", IP, Pipe Stub","Tee Fitting, PVC, 1-1/2\", IP, Pipe Stub",{"$f":"'Cost Data'!D538","v":146}]
["MF81T-P-200","MF81T-P-200","Tee Fitting, PVC, 2\", IP, Pipe Stub","Tee Fitting, PVC, 2\", IP, Pipe Stub","Tee Fitting, PVC, 2\", IP, Pipe Stub","Tee Fitting, PVC, 2\", IP, Pipe Stub",{"$f":"'Cost Data'!D539","v":153}]
["MF81T-P-200-18","MF81T-P-200-","Tee Fitting, PVC, Flanged Ends, 2\", IP","18 Tee Fitting, PVC, Flanged Ends, 2\", IP","18 Tee Fitting, PVC, Flanged Ends, 2\", IP","18 Tee Fitting, PVC, Flanged Ends, 2\", IP",{"$f":"'Cost Data'!D540","v":279}]
[null,null,"Carbon Steel"]
["MF81T-C-050",null,"Tee Fitting, Carbon Steel, 1/2\", IP",null,null,null,{"$f":"'Cost Data'!D541","v":355}]
["MF81T-C-075",null,"Tee Fitting, Carbon Steel, 3/4\", IP",null,null,null,{"$f":"'Cost Data'!D542","v":384}]
["MF81T-C-100",null,"Tee Fitting, Carbon Steel, 1\", IP",null,null,null,{"$f":"'Cost Data'!D543","v":424}]
["MF81T-C-150",null,"Tee Fitting, Carbon Steel, 1-1/2\", IP",null,null,null,{"$f":"'Cost Data'!D544","v":520}]
["MF81T-C-200",null,"Tee Fitting, Carbon Steel, 2\", IP",null,null,null,{"$f":"'Cost Data'!D545","v":596}]
["MF81T-C-200-34",null,"Tee Fitting, Carbon Steel, Flanged Ends, 2\", IP",null,null,null,{"$f":"'Cost Data'!D546","v":1004}]
["MF81T-C-050-HP",null,"Tee Fitting, Carbon Steel, Hi Pres, 1/2\", IP",null,null,null,{"$f":"'Cost Data'!D547","v":559}]
["MF81T-C-075-HP",null,"Tee Fitting, Carbon Steel, Hi Pres, 3/4\", IP",null,null,null,{"$f":"'Cost Data'!D548","v":476}]
["MF81T-C-100-HP",null,"Tee Fitting, Carbon Steel, Hi Pres, 1\", IP",null,null,null,{"$f":"'Cost Data'!D549","v":614}]
["MF81T-C-150-HP",null,"Tee Fitting, Carbon Steel, Hi Pres, 1-1/2\", IP",null,null,null,{"$f":"'Cost Data'!D550","v":701}]
["MF81T-C-200-H",null,"Tee Fitting, Carbon Steel, Hi Pres, 2\", IP",null,null,null,{"$f":"'Cost Data'!D551","v":785}]
["MF81T-C-200-34-HP",null,"Tee Fitting, Carbon Steel, Flanged Ends, Hi Pres, 2\", IP",null,null,null,{"$f":"'Cost Data'!D552","v":1155}]
[null,null,"Stainless Steel"]
["MF81T-S-050",null,"Tee Fitting, 304 SS, 1/2\", IP ",null,null,null,{"$f":"'Cost Data'!D553","v":565}]
["MF81T-S-075","MF81T-S-075 Tee Fitting, 304 SS, 3/4\", IP ","Tee Fitting, 304 SS, 3/4\", IP ","MF81T-S-075 Tee Fitting, 304 SS, 3/4\", IP ","MF81T-S-075 Tee Fitting, 304 SS, 3/4\", IP ","MF81T-S-075 Tee Fitting, 304 SS, 3/4\", IP ",{"$f":"'Cost Data'!D554","v":579}]
["MF81T-S-100","MF81T-S-100 Tee Fitting, 304 SS, 1\", IP ","Tee Fitting, 304 SS, 1\", IP ","MF81T-S-100 Tee Fitting, 304 SS, 1\", IP ","MF81T-S-100 Tee Fitting, 304 SS, 1\", IP ","MF81T-S-100 Tee Fitting, 304 SS, 1\", IP ",{"$f":"'Cost Data'!D555","v":603}]
["MF81T-S-150","MF81T-S-150 Tee Fitting, 304 SS, 1-1/2\", IP ","Tee Fitting, 304 SS, 1-1/2\", IP ","MF81T-S-150 Tee Fitting, 304 SS, 1-1/2\", IP ","MF81T-S-150 Tee Fitting, 304 SS, 1-1/2\", IP ","MF81T-S-150 Tee Fitting, 304 SS, 1-1/2\", IP ",{"$f":"'Cost Data'!D556","v":616}]
["MF81T-S-200","MF81T-S-200 Tee Fitting, 304 SS, 2\", IP ","Tee Fitting, 304 SS, 2\", IP ","MF81T-S-200 Tee Fitting, 304 SS, 2\", IP ","MF81T-S-200 Tee Fitting, 304 SS, 2\", IP ","MF81T-S-200 Tee Fitting, 304 SS, 2\", IP ",{"$f":"'Cost Data'!D557","v":637}]
["MF81T-S-050-14","MF81T-S-050-14 Tee Fitting, 316 SS, 1/2\", IP ","Tee Fitting, 316 SS, 1/2\", IP ","MF81T-S-050-14 Tee Fitting, 316 SS, 1/2\", IP ","MF81T-S-050-14 Tee Fitting, 316 SS, 1/2\", IP ","MF81T-S-050-14 Tee Fitting, 316 SS, 1/2\", IP ",{"$f":"'Cost Data'!D558","v":748}]
["MF81T-S-075-14","MF81T-S-075-14 Tee Fitting, 316 SS, 3/4\", IP ","Tee Fitting, 316 SS, 3/4\", IP ","MF81T-S-075-14 Tee Fitting, 316 SS, 3/4\", IP ","MF81T-S-075-14 Tee Fitting, 316 SS, 3/4\", IP ","MF81T-S-075-14 Tee Fitting, 316 SS, 3/4\", IP ",{"$f":"'Cost Data'!D559","v":761}]
["MF81T-S-100-14","MF81T-S-100-14 Tee Fitting, 316 SS, 1\", IP ","Tee Fitting, 316 SS, 1\", IP ","MF81T-S-100-14 Tee Fitting, 316 SS, 1\", IP ","MF81T-S-100-14 Tee Fitting, 316 SS, 1\", IP ","MF81T-S-100-14 Tee Fitting, 316 SS, 1\", IP ",{"$f":"'Cost Data'!D560","v":874}]
["MF81T-S-150-14","MF81T-S-150-14 Tee Fitting, 316 SS, 1-1/2\", IP ","Tee Fitting, 316 SS, 1-1/2\", IP ","MF81T-S-150-14 Tee Fitting, 316 SS, 1-1/2\", IP ","MF81T-S-150-14 Tee Fitting, 316 SS, 1-1/2\", IP ","MF81T-S-150-14 Tee Fitting, 316 SS, 1-1/2\", IP ",{"$f":"'Cost Data'!D561","v":903}]
["MF81T-S-200-14","MF81T-S-200-14 Tee Fitting, 316 SS, 2\", IP ","Tee Fitting, 316 SS, 2\", IP ","MF81T-S-200-14 Tee Fitting, 316 SS, 2\", IP ","MF81T-S-200-14 Tee Fitting, 316 SS, 2\", IP ","MF81T-S-200-14 Tee Fitting, 316 SS, 2\", IP ",{"$f":"'Cost Data'!D562","v":948}]
["MF81T-S-050-HP","MF81T-S-050-HP Tee Fitting, 304 SS, Hi Pres, 1/2\", IP ","Tee Fitting, 304 SS, Hi Pres, 1/2\", IP ","MF81T-S-050-HP Tee Fitting, 304 SS, Hi Pres, 1/2\", IP ","MF81T-S-050-HP Tee Fitting, 304 SS, Hi Pres, 1/2\", IP ","MF81T-S-050-HP Tee Fitting, 304 SS, Hi Pres, 1/2\", IP ",{"$f":"'Cost Data'!D563","v":616}]
["MF81T-S-075-HP","MF81T-S-075-HP Tee Fitting, 304 SS, Hi Pres, 3/4\", IP ","Tee Fitting, 304 SS, Hi Pres, 3/4\", IP ","MF81T-S-075-HP Tee Fitting, 304 SS, Hi Pres, 3/4\", IP ","MF81T-S-075-HP Tee Fitting, 304 SS, Hi Pres, 3/4\", IP ","MF81T-S-075-HP Tee Fitting, 304 SS, Hi Pres, 3/4\", IP ",{"$f":"'Cost Data'!D564","v":632}]
["MF81T-S-100-HP","MF81T-S-100-HP Tee Fitting, 304 SS, Hi Pres, 1\", IP ","Tee Fitting, 304 SS, Hi Pres, 1\", IP ","MF81T-S-100-HP Tee Fitting, 304 SS, Hi Pres, 1\", IP ","MF81T-S-100-HP Tee Fitting, 304 SS, Hi Pres, 1\", IP ","MF81T-S-100-HP Tee Fitting, 304 SS, Hi Pres, 1\", IP ",{"$f":"'Cost Data'!D565","v":637}]
["MF81T-S-150-HP ","MF81T-S-150-HP Tee Fitting, 304 SS, Hi Pres, 1-1/2\", IP ","Tee Fitting, 304 SS, Hi Pres, 1-1/2\", IP ","MF81T-S-150-HP Tee Fitting, 304 SS, Hi Pres, 1-1/2\", IP ","MF81T-S-150-HP Tee Fitting, 304 SS, Hi Pres, 1-1/2\", IP ","MF81T-S-150-HP Tee Fitting, 304 SS, Hi Pres, 1-1/2\", IP ",{"$f":"'Cost Data'!D566","v":649}]
["MF81T-S-200-HP","MF81T-S-200-HP Tee Fitting, 304 SS, Hi Pres, 2\", IP ","Tee Fitting, 304 SS, Hi Pres, 2\", IP ","MF81T-S-200-HP Tee Fitting, 304 SS, Hi Pres, 2\", IP ","MF81T-S-200-HP Tee Fitting, 304 SS, Hi Pres, 2\", IP ","MF81T-S-200-HP Tee Fitting, 304 SS, Hi Pres, 2\", IP ",{"$f":"'Cost Data'!D567","v":662}]
["MF81T-S-050-14-HP ","MF81T-S-050-14-HP Tee Fitting, 316 SS, Hi Pres, 1/2\", IP ","Tee Fitting, 316 SS, Hi Pres, 1/2\", IP ","MF81T-S-050-14-HP Tee Fitting, 316 SS, Hi Pres, 1/2\", IP ","MF81T-S-050-14-HP Tee Fitting, 316 SS, Hi Pres, 1/2\", IP ","MF81T-S-050-14-HP Tee Fitting, 316 SS, Hi Pres, 1/2\", IP ",{"$f":"'Cost Data'!D568","v":870}]
["MF81T-S-075-14-HP","MF81T-S-075-14-HP Tee Fitting, 316 SS, Hi Pres, 3/4\", IP ","Tee Fitting, 316 SS, Hi Pres, 3/4\", IP ","MF81T-S-075-14-HP Tee Fitting, 316 SS, Hi Pres, 3/4\", IP ","MF81T-S-075-14-HP Tee Fitting, 316 SS, Hi Pres, 3/4\", IP ","MF81T-S-075-14-HP Tee Fitting, 316 SS, Hi Pres, 3/4\", IP ",{"$f":"'Cost Data'!D569","v":910}]
["MF81T-S-100-14-HP","MF81T-S-100-14-HP Tee Fitting, 316 SS, Hi Pres, 1\", IP ","Tee Fitting, 316 SS, Hi Pres, 1\", IP ","MF81T-S-100-14-HP Tee Fitting, 316 SS, Hi Pres, 1\", IP ","MF81T-S-100-14-HP Tee Fitting, 316 SS, Hi Pres, 1\", IP ","MF81T-S-100-14-HP Tee Fitting, 316 SS, Hi Pres, 1\", IP ",{"$f":"'Cost Data'!D570","v":958}]
["MF81T-S-150-14-HP","MF81T-S-150-14-HP Tee Fitting, 316 SS, Hi Pres, 1-1/2\", IP ","Tee Fitting, 316 SS, Hi Pres, 1-1/2\", IP ","MF81T-S-150-14-HP Tee Fitting, 316 SS, Hi Pres, 1-1/2\", IP ","MF81T-S-150-14-HP Tee Fitting, 316 SS, Hi Pres, 1-1/2\", IP ","MF81T-S-150-14-HP Tee Fitting, 316 SS, Hi Pres, 1-1/2\", IP ",{"$f":"'Cost Data'!D571","v":983}]
["MF81T-S-200-14-HP","MF81T-S-200-14-HP Tee Fitting, 316 SS, Hi Pres, 2\", IP ","Tee Fitting, 316 SS, Hi Pres, 2\", IP ","MF81T-S-200-14-HP Tee Fitting, 316 SS, Hi Pres, 2\", IP ","MF81T-S-200-14-HP Tee Fitting, 316 SS, Hi Pres, 2\", IP ","MF81T-S-200-14-HP Tee Fitting, 316 SS, Hi Pres, 2\", IP ",{"$f":"'Cost Data'!D572","v":1016}]
["MF81T-S-200-20","MF81T-S-200-20 Tee Fitting, 304 SS, 2\", Flanged Ends, IP ","Tee Fitting, 304 SS, 2\", Flanged Ends, IP ","MF81T-S-200-20 Tee Fitting, 304 SS, 2\", Flanged Ends, IP ","MF81T-S-200-20 Tee Fitting, 304 SS, 2\", Flanged Ends, IP ","MF81T-S-200-20 Tee Fitting, 304 SS, 2\", Flanged Ends, IP ",{"$f":"'Cost Data'!D573","v":1046}]
["MF81T-S-200-20-HP","MF81T-S-200-20-HP Tee Fitting, 304 SS,Flanged Ends, Hi Pres, 2\", IP ","Tee Fitting, 304 SS,Flanged Ends, Hi Pres, 2\", IP ","MF81T-S-200-20-HP Tee Fitting, 304 SS,Flanged Ends, Hi Pres, 2\", IP ","MF81T-S-200-20-HP Tee Fitting, 304 SS,Flanged Ends, Hi Pres, 2\", IP ","MF81T-S-200-20-HP Tee Fitting, 304 SS,Flanged Ends, Hi Pres, 2\", IP ",{"$f":"'Cost Data'!D574","v":1119}]
["MF81T-S-200-14-20-HP","MF81T-S-200-14-20-HP Tee Fitting, 316 SS, Flanged Ends, Hi Pres, 2\", IP ","Tee Fitting, 316 SS, Flanged Ends, Hi Pres, 2\", IP ","MF81T-S-200-14-20-HP Tee Fitting, 316 SS, Flanged Ends, Hi Pres, 2\", IP ","MF81T-S-200-14-20-HP Tee Fitting, 316 SS, Flanged Ends, Hi Pres, 2\", IP ","MF81T-S-200-14-20-HP Tee Fitting, 316 SS, Flanged Ends, Hi Pres, 2\", IP ",{"$f":"'Cost Data'!D575","v":1368}]
["EX800 Series Saddle Fittings"]
["Model #",null,"Description",null,null,null,"Price"]
[null,null,"Ductile Iron"]
["MF82S-F-300",null,"Saddle, Iron, 3\", (3.45 - 4.05 O.D. range)",null,null,null,{"$f":"'Cost Data'!D577","v":309}]
["MF82S-F-400",null,"Saddle, Iron, 4\", (4.00 - 4.50 O.D. range)",null,null,null,{"$f":"'Cost Data'!D578","v":343}]
["MF82S-F-600",null,"Saddle, Iron, 6\", (6.00 - 6.63 O.D. range)",null,null,null,{"$f":"'Cost Data'!D579","v":398}]
["MF82S-F-800",null,"Saddle, Iron, 8\", (8.00 - 8.63 O.D. range)",null,null,null,{"$f":"'Cost Data'!D580","v":425}]
[null,null,"Bronze"]
["MF82S-B-300",null,"Saddle, Bronze, 3\"",null,null,null,{"$f":"'Cost Data'!D581","v":566}]
["MF82S-B-400",null,"Saddle, Bronze, 4\"",null,null,null,{"$f":"'Cost Data'!D582","v":623}]
[null,null,"PVC"]
["MF82S-P-300",null,"Saddle, PVC, 3\"",null,null,null,{"$f":"'Cost Data'!D583","v":172}]
["MF82S-P-400",null,"Saddle, PVC, 4\"",null,null,null,{"$f":"'Cost Data'!D584","v":201}]
["MF82S-P-600",null,"Saddle, PVC, 6\"",null,null,null,{"$f":"'Cost Data'!D585","v":236}]
["MF82S-P-800",null,"Saddle, PVC, 8\"",null,null,null,{"$f":"'Cost Data'!D586","v":269}]
["MF82S-P-300-16",null,"Saddle, PVC, 3\",w/ 16\" Length Pipe Stub",null,null,null,{"$f":"'Cost Data'!D587","v":224}]
["MF82S-P-400-16",null,"Saddle, PVC, 4\",w/ 16\" Length Pipe Stub",null,null,null,{"$f":"'Cost Data'!D588","v":253}]
["MF82S-P-600-16",null,"Saddle, PVC, 6\",w/ 16\" Length Pipe Stub",null,null,null,{"$f":"'Cost Data'!D589","v":292}]
["MF82S-P-800-16",null,"Saddle, PVC, 8\",w/ 16\" Length Pipe Stub",null,null,null,{"$f":"'Cost Data'!D590","v":337}]
["IP800 Series Weld/Braze Fittings"]
["Model #",null,"Description",null,null,null,"Price"]
[null,null,"Brass"]
["MF82W-B-300",null,"Weldolet, Brass, 3\"",null,null,null,153]
["MF82W-B-400",null,"Weldolet, Brass, 4\"",null,null,null,153]
["MF82W-B-600",null,"Weldolet, Brass, 6\"",null,null,null,153]
["MF82W-B-800",null,"Weldolet, Brass, 8\"",null,null,null,153]
[null,null,"Carbon Steel"]
["MF82W-C-300",null,"Weldolet, Carbon Steel, 3\"",null,null,null,{"$f":"'Cost Data'!D596","v":190}]
["MF82W-C-400",null,"Weldolet, Carbon Steel, 4\"",null,null,null,{"$f":"'Cost Data'!D597","v":190}]
["MF82W-C-600",null,"Weldolet, Carbon Steel, 6\"",null,null,null,{"$f":"'Cost Data'!D598","v":190}]
["MF82W-C-800",null,"Weldolet, Carbon Steel, 8\"",null,null,null,{"$f":"'Cost Data'!D599","v":190}]
["MF82W-C-300-HP",null,"Weldolet, Carbon Steel, Hi Pres, 3\"",null,null,null,{"$f":"'Cost Data'!D600","v":207}]
["MF82W-C-400-HP",null,"Weldolet, Carbon Steel, Hi Pres, 4\"",null,null,null,{"$f":"'Cost Data'!D601","v":207}]
["MF82W-C-600-HP",null,"Weldolet, Carbon Steel, Hi Pres, 6\"",null,null,null,{"$f":"'Cost Data'!D602","v":207}]
["MF82W-C-800-HP",null,"Weldolet, Carbon Steel, Hi Pres, 8\"",null,null,null,{"$f":"'Cost Data'!D603","v":207}]
[null,null,"Stainless Steel"]
["MF82W-S-300",null,"Weldolet, 316 SS, 3\"",null,null,null,{"$f":"'Cost Data'!D604","v":256}]
["MF82W-S-400",null,"Weldolet, 316 SS, 4\"",null,null,null,{"$f":"'Cost Data'!D605","v":256}]
["MF82W-S-600",null,"Weldolet, 316 SS, 6\"",null,null,null,{"$f":"'Cost Data'!D606","v":256}]
["MF82W-S-800",null,"Weldolet, 316 SS, 8\"",null,null,null,{"$f":"'Cost Data'!D607","v":256}]
["MF82W-S-300-HP",null,"Weldolet, 316 SS, Hi Pres, 3\"",null,null,null,{"$f":"'Cost Data'!D608","v":276}]
["MF82W-S-400-HP",null,"Weldolet, 316 SS, Hi Pres, 4\"",null,null,null,{"$f":"'Cost Data'!D609","v":276}]
["MF82W-S-600-HP",null,"Weldolet, 316 SS, Hi Pres, 6\"",null,null,null,{"$f":"'Cost Data'!D610","v":276}]
["MF82W-S-800-HP",null,"Weldolet, 316 SS, Hi Pres, 8\"",null,null,null,{"$f":"'Cost Data'!D611","v":276}]
["IP800 Series Parts & Accessories"]
["Model #",null,"Description",null,null,null,"Price"]
[100251,null,"Cap, Blind, Brass, EX/IP/TX800 Series",null,null,null,{"$f":"'Cost Data'!D613","v":72}]
[100249,null,"Cap, Blind, Polypro, EX/IP/TX800 series",null,null,null,{"$f":"'Cost Data'!D614","v":49}]
[100248,null,"Cap, Blind, PVC, EX/IP/TX800 series",null,null,null,{"$f":"'Cost Data'!D615","v":49}]
[100250,null,"Cap, Blind, SS, EX/IP/TX800 series",null,null,null,{"$f":"'Cost Data'!D616","v":97}]
[101850,null,"Strain Relief Kit Large, 1/2\", NPT",null,null,null,{"$f":"'Cost Data'!D617","v":21}]
[102021,null,"Hinged Display Cover Kit",null,null,null,{"$f":"'Cost Data'!D618","v":64}]
[104027,null,"Security Hinged Display Cover Kit",null,null,null,{"$f":"'Cost Data'!D619","v":64}]
[103702,null,"White Housing Screw/Washer Kit",null,null,null,{"$f":"'Cost Data'!D620","v":4}]
[100264,null,"O-Ring, EPDM, Sensor Shaft",null,null,null,{"$f":"'Cost Data'!D621","v":17}]
[100219,null,"O-Ring, Viton®, Brown",null,null,null,{"$f":"'Cost Data'!D622","v":21}]
[100317,null,"Rotor Repair Kit, Kynar® Tungsten Carbide, 6 Magnet, High-Res",null,null,null,{"$f":"'Cost Data'!D623","v":163}]
[100556,null,"Rotor Repair Kit, Kynar® Silicon Carbide, 6 Magnet, High-Res",null,null,null,{"$f":"'Cost Data'!D624","v":223}]
[100043,null,"Rotor Repair Kit, Kynar® Ceramic, 6 Magnet, High-Res",null,null,null,{"$f":"'Cost Data'!D625","v":251}]
[103315,null,"Bearing Assembly Kit, IP/TX800, Kynar (Includes 2 Bearings)",null,null,null,{"$f":"'Cost Data'!D626","v":83}]
[100853,null,"Security Seal, w/12\" of Wire",null,null,null,{"$f":"'Cost Data'!D627","v":5}]
[100419,null,"Sensor Assy, Blue, Low Power, 18' (For External Powered Displays)",null,null,null,{"$f":"'Cost Data'!D628","v":120}]
[100508,null,"Sensor Assy, Grey Micropowered, 18' (For Battery Powered Displays)",null,null,null,{"$f":"'Cost Data'!D629","v":202}]
[100298,null,"Sensor Retaining Screw",null,null,null,{"$f":"'Cost Data'!D630","v":39}]
[100375,null,"Spanner Tool, Sensor, Retain Screw",null,null,null,{"$f":"'Cost Data'!D631","v":70}]
[104000,null,"Standard U-Clip",null,null,null,{"$f":"'Cost Data'!D632","v":15}]
[101776,null,"HP Retaining Pin (2 Required), For HP units only",null,null,null,{"$f":"'Cost Data'!D633","v":29}]
[100854,null,"Wire, for Security Seal, 12\" (For 3\" Only)",null,null,null,{"$f":"'Cost Data'!D634","v":3}]
["Cables & Connectors"]
["Model #",null,"Description",null,null,null,"Price"]
[100852,null,"Cable, Shielded, 4-Con, EX W/O Reverse Flow (Per Ft.)",null,null,null,{"$f":"'Cost Data'!D898","v":5}]
[100835,null,"Cable, Shielded, 6-Con, EX W/ Reverse Flow (Per Ft.)",null,null,null,{"$f":"'Cost Data'!D899","v":6}]
[100010,null,"Cable, Unshielded, 2 Con, MJ-WJ-AO55 (Per Ft.)",null,null,null,{"$f":"'Cost Data'!D900","v":3}]
[100451,null,"Cable, Unshielded, 3 Con, Blue, Low Power, IP-TX-WT-S Series (Per Ft.)",null,null,null,{"$f":"'Cost Data'!D901","v":3}]
[100011,null,"Cable, Unshielded, 3 Con, Grey Micropower (IP,TX,WT,SPX,SPT,SES)",null,null,null,{"$f":"'Cost Data'!D902","v":3}]
[100014,null,"Cable, Unshielded, 4 Con, FT440, (Per Ft.)",null,null,null,{"$f":"'Cost Data'!D903","v":4}]
[100649,null,"Cable, Unshielded, 3 Con, MJE (Per Ft.)",null,null,null,{"$f":"'Cost Data'!D904","v":3}]
[100008,null,"Connector, Female, LMI 4pin, Female",null,null,null,{"$f":"'Cost Data'!D905","v":40}]
[100006,null,"Connector, Seametrics 3-Pin BulkHead",null,null,null,{"$f":"'Cost Data'!D906","v":40}]
[100007,null,"Connector, Seametrics 3-Pin Cable End",null,null,null,{"$f":"'Cost Data'!D907","v":40}]
[101783,null,"Roytronics® Series-A Pump 5 Pin Connector",null,null,null,{"$f":"'Cost Data'!D908","v":41}]
[]
["Cables & Connectors Assemblies"]
["Model #",null,"Description",null,null,null,"Price"]
[100039,null,"Cable Assy, 12' Unshielded, 2 Con, LMI 4-Pin Connector",null,null,null,{"$f":"'Cost Data'!D910","v":54}]
[100013,null,"Cable Assy, 12' Unshielded, 3 Con, LMI 4-Pin Connector, 1K Resistor","Cable Assy, 12' Unshielded, 3 Con, LMI 4-Pin Connector, 1K Resistor","Cable Assy, 12' Unshielded, 3 Con, LMI 4-Pin Connector, 1K Resistor","Cable Assy, 12' Unshielded, 3 Con, LMI 4-Pin Connector, 1K Resistor",{"$f":"'Cost Data'!D911","v":54}]
[100395,null,"Cable Assy, 12' Unshielded, 2 Con, Seametrics 3-Pin Connector","Cable Assy, 12' Unshielded, 2 Con, Seametrics 3-Pin Connector","Cable Assy, 12' Unshielded, 2 Con, Seametrics 3-Pin Connector","Cable Assy, 12' Unshielded, 2 Con, Seametrics 3-Pin Connector",{"$f":"'Cost Data'!D912","v":54}]
[100041,null,"Cable Assy, 12' Unshielded, 3 Con, Seametrics 3-Pin Connector","Cable Assy, 12' Unshielded, 3 Con, Seametrics 3-Pin Connector","Cable Assy, 12' Unshielded, 3 Con, Seametrics 3-Pin Connector","Cable Assy, 12' Unshielded, 3 Con, Seametrics 3-Pin Connector",{"$f":"'Cost Data'!D913","v":54}]
[101587,null,"Cable Assy, 12' Unshielded, 2 Con, LMI 5-Pin Connector","Cable Assy, 12' Unshielded, 2 Con, LMI 5-Pin Connector","Cable Assy, 12' Unshielded, 2 Con, LMI 5-Pin Connector","Cable Assy, 12' Unshielded, 2 Con, LMI 5-Pin Connector",{"$f":"'Cost Data'!D914","v":54}]
[101576,null,"Cable Assy, 12' Unshielded, 3 Con, LMI 5-Pin Connector","Cable Assy, 12' Unshielded, 3 Con, LMI 5-Pin Connector","Cable Assy, 12' Unshielded, 3 Con, LMI 5-Pin Connector","Cable Assy, 12' Unshielded, 3 Con, LMI 5-Pin Connector",{"$f":"'Cost Data'!D915","v":54}]
[100044,null,"Sensor Assy, MJR, Single Reed Switch, LMI Pump 4-Pin Connector","Sensor Assy, MJR, Single Reed Switch, LMI Pump 4-Pin Connector","Sensor Assy, MJR, Single Reed Switch, LMI Pump 4-Pin Connector","Sensor Assy, MJR, Single Reed Switch, LMI Pump 4-Pin Connector",{"$f":"'Cost Data'!D916","v":113}]
[100045,null,"Sensor Assy, MJR, Dual Reed Switch, LMI Pump 4-Pin Connector","Sensor Assy, MJR, Dual Reed Switch, LMI Pump 4-Pin Connector","Sensor Assy, MJR, Dual Reed Switch, LMI Pump 4-Pin Connector","Sensor Assy, MJR, Dual Reed Switch, LMI Pump 4-Pin Connector",{"$f":"'Cost Data'!D917","v":123}]
[100049,null,"Sensor Assy, MJE, Single Hall Effect, LMI Pump 4-Pin Connector","Sensor Assy, MJE, Single Hall Effect, LMI Pump 4-Pin Connector","Sensor Assy, MJE, Single Hall Effect, LMI Pump 4-Pin Connector","Sensor Assy, MJE, Single Hall Effect, LMI Pump 4-Pin Connector",{"$f":"'Cost Data'!D918","v":113}]
[100046,null,"Sensor Assy, MJR, Single Reed Switch, Seametrics Control Connector","Sensor Assy, MJR, Single Reed Switch, Seametrics Control Connector","Sensor Assy, MJR, Single Reed Switch, Seametrics Control Connector","Sensor Assy, MJR, Single Reed Switch, Seametrics Control Connector",{"$f":"'Cost Data'!D919","v":113}]
[100047,null,"Sensor Assy, MJR, Dual Reed Switch, Seametrics Control Connector","Sensor Assy, MJR, Dual Reed Switch, Seametrics Control Connector","Sensor Assy, MJR, Dual Reed Switch, Seametrics Control Connector","Sensor Assy, MJR, Dual Reed Switch, Seametrics Control Connector",{"$f":"'Cost Data'!D920","v":123}]
[100048,null,"Sensor Assy, MJE, Single Hall Effect, Seametrics Control Cable","Sensor Assy, MJE, Single Hall Effect, Seametrics Control Cable","Sensor Assy, MJE, Single Hall Effect, Seametrics Control Cable","Sensor Assy, MJE, Single Hall Effect, Seametrics Control Cable",{"$f":"'Cost Data'!D921","v":113}]
[101588,null,"Sensor Assy, MJR, Single Reed Switch, LMI Pump 5-Pin Connector","Sensor Assy, MJR, Single Reed Switch, LMI Pump 5-Pin Connector","Sensor Assy, MJR, Single Reed Switch, LMI Pump 5-Pin Connector","Sensor Assy, MJR, Single Reed Switch, LMI Pump 5-Pin Connector",{"$f":"'Cost Data'!D922","v":113}]
[101589,null,"Sensor Assy, MJR, Dual Reed SW, LMI Pump 5-Pin Connector","Sensor Assy, MJR, Dual Reed SW, LMI Pump 5-Pin Connector","Sensor Assy, MJR, Dual Reed SW, LMI Pump 5-Pin Connector","Sensor Assy, MJR, Dual Reed SW, LMI Pump 5-Pin Connector",{"$f":"'Cost Data'!D923","v":113}]
[101590,null,"Sensor Assy, MJE, Single Hall Effect, LMI Pump 5-Pin Connector","Sensor Assy, MJE, Single Hall Effect, LMI Pump 5-Pin Connector","Sensor Assy, MJE, Single Hall Effect, LMI Pump 5-Pin Connector","Sensor Assy, MJE, Single Hall Effect, LMI Pump 5-Pin Connector",{"$f":"'Cost Data'!D924","v":123}]

{"sheet":"S-Series","index":13,"n_rows":87,"n_cols":9,"rows_kept":87,"cut":false,"hidden":false,"merged":[[45,2,45,5],[46,2,46,5],[47,2,47,5],[86,0,86,1],[86,2,86,5],[83,0,83,1],[83,2,83,5],[84,0,84,1],[84,2,84,5],[85,0,85,1],[85,2,85,5],[80,0,80,1],[80,2,80,5],[81,0,81,1],[81,2,81,5],[82,0,82,1],[82,2,82,5],[79,2,79,5],[74,0,74,1],[74,2,74,5],[75,0,75,1],[75,2,75,5],[76,0,76,1],[76,2,76,5],[79,0,79,1],[67,0,67,1],[67,2,67,5],[68,0,68,1],[68,2,68,5],[70,0,70,6],[64,0,64,1],[64,2,64,5],[65,0,65,1],[65,2,65,5],[66,0,66,1],[66,2,66,5],[71,0,71,1],[71,2,71,5],[72,0,72,1],[72,2,72,5],[73,0,73,1],[73,2,73,5],[77,0,77,1],[77,2,77,5],[78,0,78,1],[78,2,78,5],[61,0,61,1],[61,2,61,5],[62,0,62,1],[62,2,62,5],[63,0,63,1],[63,2,63,5],[58,0,58,1],[58,2,58,5],[59,0,59,1],[59,2,59,5],[60,0,60,1],[60,2,60,5],[56,0,56,6],[57,0,57,1],[57,2,57,5],[44,0,44,1],[45,0,45,1],[46,0,46,1],[48,0,48,1],[49,0,49,1],[47,0,47,1],[50,0,50,1],[51,0,51,1],[52,0,52,1],[53,0,53,1],[54,0,54,1],[48,2,48,5],[49,2,49,5],[55,0,55,1],[55,2,55,5],[50,2,50,5],[51,2,51,5],[52,2,52,5],[53,2,53,5],[54,2,54,5],[44,2,44,5],[2,6,2,7],[4,4,4,6],[36,0,36,1],[32,0,32,7],[33,0,33,1],[19,4,22,4],[27,4,30,4],[23,4,26,4],[34,2,34,5],[35,2,35,5],[36,2,36,5],[15,2,16,2],[19,1,22,1],[23,1,26,1],[27,1,30,1],[34,0,34,1],[35,0,35,1],[25,3,26,3],[21,3,22,3],[37,0,37,1],[38,0,38,1],[39,0,39,1],[41,0,41,1],[42,0,42,1],[40,0,40,1],[43,0,43,1],[37,2,37,5],[2,2,2,5],[38,2,38,5],[39,2,39,5],[40,2,40,5],[41,2,41,5],[42,2,42,5],[43,2,43,5],[27,3,30,3],[19,0,22,0],[23,0,26,0],[27,0,30,0]]}
[]
[]
[null,{"$f":"_xlfn.TEXTJOIN(\"-\",TRUE,B18,C18,D18)","v":"Please Select"},{"$f":"F18","v":""},null,null,null,{"$f":"_xlfn.TEXTJOIN(\"-\",TRUE,B3,C3)","v":"Please Select"}]
[null,"Meter","Options"]
["Costs",{"$f":"_xlfn.IFS(B3=\"SES-050\",'Cost Data'!D650,B3=\"SES-075\",'Cost Data'!D651,B3=\"SES-100\",'Cost Data'!D652, B3=\"SPT-038\",'Cost Data'!D653, B3=\"SPT-038-70\",'Cost Data'!D654, B3=\"SPT-038-117\",'Cost Data'!D655, B3=\"SPT-050\",'Cost Data'!D656, B3=\"SPT-050-70\",'Cost Data'!D657, B3=\"SPT-050-117\",'Cost Data'!D658, B3=\"SPT-075\",'Cost Data'!D659, B3=\"SPT-075-70\",'Cost Data'!D660, B3=\"SPT-075-117\",'Cost Data'!D661, B3=\"SPT-100\",'Cost Data'!D662, B3=\"SPT-100-70\",'Cost Data'!D663, B3=\"SPT-100-117\",'Cost Data'!D664, B3=\"SPX-038\",'Cost Data'!D665, B3=\"SPX-038-70\",'Cost Data'!D666, B3=\"SPX-038-116\",'Cost Data'!D667, B3=\"SPX-050\",'Cost Data'!D668, B3=\"SPX-050-70\",'Cost Data'!D669, B3=\"SPX-050-116\",'Cost Data'!D670, B3=\"SPX-075\",'Cost Data'!D671, B3=\"SPX-075-70\",'Cost Data'!D672, B3=\"SPX-075-116\",'Cost Data'!D673, B3=\"SPX-100\",'Cost Data'!D674, B3=\"SPX-100-70\",'Cost Data'!D675, B3=\"SPX-100-116\",'Cost Data'!D676)","v":{"$error":"#N/A"}},{"$f":"SUM(D7:D16)","v":0},null,"Total",null,null,{"$f":"B5+C5","v":{"$error":"#N/A"}}]
[null,null,null,null,null,null,"Available Options","All Options"]
[null,null,null,{"$f":"_xlfn.IFS(F7=\"\",0,F7=$H$7,'Cost Data'!$D$677,F7=$H$8,'Cost Data'!$D$678,F7=$H$9,'Cost Data'!$D$679,F7=$H$10,'Cost Data'!$D$680,F7=$H$11,'Cost Data'!$D$681,F7=$H$12,'Cost Data'!$D$682,F7=$H$13,'Cost Data'!$D$683,F7=$H$14,'Cost Data'!$D$684,F7=$H$15,'Cost Data'!$D$685,F7=$H$16,'Cost Data'!$D$686,F7=$H$17,'Cost Data'!$D$687)","v":0},"Option 1",null,{"$f":"_xlfn.IFS($B$18=\"\",\" \",$B$18=$B$20,F20,$B$18=$B$24,G20,$B$18=$B$28,H20)","v":" "},"Rotor w/ Ceramic Shaft, PVDF, Kynar = -01",{"$f":"_xlfn.IFS(F7=\"\",\"\",F7=$H$7,\"01\",F7=$H$8,\"04\",F7=$H$9,\"06\",F7=$H$10,\"07\",F7=$H$11,12,F7=$H$12,13,F7=$H$13,25,F7=$H$14,60,F7=$H$15,68,F7=$H$16,69,F7=$H$17,106)","v":""}]
[null,null,null,{"$f":"_xlfn.IFS(F8=\"\",0,F8=$H$7,'Cost Data'!$D$677,F8=$H$8,'Cost Data'!$D$678,F8=$H$9,'Cost Data'!$D$679,F8=$H$10,'Cost Data'!$D$680,F8=$H$11,'Cost Data'!$D$681,F8=$H$12,'Cost Data'!$D$682,F8=$H$13,'Cost Data'!$D$683,F8=$H$14,'Cost Data'!$D$684,F8=$H$15,'Cost Data'!$D$685,F8=$H$16,'Cost Data'!$D$686,F8=$H$17,'Cost Data'!$D$687)","v":0},"Option 2",null,{"$f":"_xlfn.IFS($B$18=\"\",\" \",$B$18=$B$20,F21,$B$18=$B$24,G21,$B$18=$B$28,H21)","v":" "},"Micropower Pickup = -04",{"$f":"_xlfn.IFS(F8=\"\",\"\",F8=$H$7,\"01\",F8=$H$8,\"04\",F8=$H$9,\"06\",F8=$H$10,\"07\",F8=$H$11,12,F8=$H$12,13,F8=$H$13,25,F8=$H$14,60,F8=$H$15,68,F8=$H$16,69,F8=$H$17,106)","v":""}]
[null,null,null,{"$f":"_xlfn.IFS(F9=\"\",0,F9=$H$7,'Cost Data'!$D$677,F9=$H$8,'Cost Data'!$D$678,F9=$H$9,'Cost Data'!$D$679,F9=$H$10,'Cost Data'!$D$680,F9=$H$11,'Cost Data'!$D$681,F9=$H$12,'Cost Data'!$D$682,F9=$H$13,'Cost Data'!$D$683,F9=$H$14,'Cost Data'!$D$684,F9=$H$15,'Cost Data'!$D$685,F9=$H$16,'Cost Data'!$D$686,F9=$H$17,'Cost Data'!$D$687)","v":0},"Option 3",null,{"$f":"_xlfn.IFS($B$18=\"\",\" \",$B$18=$B$20,F22,$B$18=$B$24,G22,$B$18=$B$28,H22)","v":" "},"LMI 4-pin Connector = -06",{"$f":"_xlfn.IFS(F9=\"\",\"\",F9=$H$7,\"01\",F9=$H$8,\"04\",F9=$H$9,\"06\",F9=$H$10,\"07\",F9=$H$11,12,F9=$H$12,13,F9=$H$13,25,F9=$H$14,60,F9=$H$15,68,F9=$H$16,69,F9=$H$17,106)","v":""}]
[null,null,null,{"$f":"_xlfn.IFS(F10=\"\",0,F10=$H$7,'Cost Data'!$D$677,F10=$H$8,'Cost Data'!$D$678,F10=$H$9,'Cost Data'!$D$679,F10=$H$10,'Cost Data'!$D$680,F10=$H$11,'Cost Data'!$D$681,F10=$H$12,'Cost Data'!$D$682,F10=$H$13,'Cost Data'!$D$683,F10=$H$14,'Cost Data'!$D$684,F10=$H$15,'Cost Data'!$D$685,F10=$H$16,'Cost Data'!$D$686,F10=$H$17,'Cost Data'!$D$687)","v":0},"Option 4",null,{"$f":"_xlfn.IFS($B$18=\"\",\" \",$B$18=$B$20,F23,$B$18=$B$24,G23,$B$18=$B$28,H23)","v":" "},"Seametrics Control Connector = -07",{"$f":"_xlfn.IFS(F10=\"\",\"\",F10=$H$7,\"01\",F10=$H$8,\"04\",F10=$H$9,\"06\",F10=$H$10,\"07\",F10=$H$11,12,F10=$H$12,13,F10=$H$13,25,F10=$H$14,60,F10=$H$15,68,F10=$H$16,69,F10=$H$17,106)","v":""}]
[null,null,null,{"$f":"_xlfn.IFS(F11=\"\",0,F11=$H$7,'Cost Data'!$D$677,F11=$H$8,'Cost Data'!$D$678,F11=$H$9,'Cost Data'!$D$679,F11=$H$10,'Cost Data'!$D$680,F11=$H$11,'Cost Data'!$D$681,F11=$H$12,'Cost Data'!$D$682,F11=$H$13,'Cost Data'!$D$683,F11=$H$14,'Cost Data'!$D$684,F11=$H$15,'Cost Data'!$D$685,F11=$H$16,'Cost Data'!$D$686,F11=$H$17,'Cost Data'!$D$687)","v":0},"Option 5",null,{"$f":"_xlfn.IFS($B$18=\"\",\" \",$B$18=$B$20,F24,$B$18=$B$24,G24,$B$18=$B$28,H24)","v":" "},"Polypro Cover = -12",{"$f":"_xlfn.IFS(F11=\"\",\"\",F11=$H$7,\"01\",F11=$H$8,\"04\",F11=$H$9,\"06\",F11=$H$10,\"07\",F11=$H$11,12,F11=$H$12,13,F11=$H$13,25,F11=$H$14,60,F11=$H$15,68,F11=$H$16,69,F11=$H$17,106)","v":""}]
[null,null,null,{"$f":"_xlfn.IFS(F12=\"\",0,F12=$H$7,'Cost Data'!$D$677,F12=$H$8,'Cost Data'!$D$678,F12=$H$9,'Cost Data'!$D$679,F12=$H$10,'Cost Data'!$D$680,F12=$H$11,'Cost Data'!$D$681,F12=$H$12,'Cost Data'!$D$682,F12=$H$13,'Cost Data'!$D$683,F12=$H$14,'Cost Data'!$D$684,F12=$H$15,'Cost Data'!$D$685,F12=$H$16,'Cost Data'!$D$686,F12=$H$17,'Cost Data'!$D$687)","v":0},"Option 6",null,{"$f":"_xlfn.IFS($B$18=\"\",\" \",$B$18=$B$20,F25,$B$18=$B$24,G25,$B$18=$B$28,H25)","v":" "},"High Resolution = -13",{"$f":"_xlfn.IFS(F12=\"\",\"\",F12=$H$7,\"01\",F12=$H$8,\"04\",F12=$H$9,\"06\",F12=$H$10,\"07\",F12=$H$11,12,F12=$H$12,13,F12=$H$13,25,F12=$H$14,60,F12=$H$15,68,F12=$H$16,69,F12=$H$17,106)","v":""}]
[null,null,null,{"$f":"_xlfn.IFS(F13=\"\",0,F13=$H$7,'Cost Data'!$D$677,F13=$H$8,'Cost Data'!$D$678,F13=$H$9,'Cost Data'!$D$679,F13=$H$10,'Cost Data'!$D$680,F13=$H$11,'Cost Data'!$D$681,F13=$H$12,'Cost Data'!$D$682,F13=$H$13,'Cost Data'!$D$683,F13=$H$14,'Cost Data'!$D$684,F13=$H$15,'Cost Data'!$D$685,F13=$H$16,'Cost Data'!$D$686,F13=$H$17,'Cost Data'!$D$687)","v":0},"Option 7",null,{"$f":"_xlfn.IFS($B$18=\"\",\" \",$B$18=$B$20,F26,$B$18=$B$24,G26,$B$18=$B$28,H26)","v":" "},"Viton O-Ring, Teflon-coated, Purple = -25",{"$f":"_xlfn.IFS(F13=\"\",\"\",F13=$H$7,\"01\",F13=$H$8,\"04\",F13=$H$9,\"06\",F13=$H$10,\"07\",F13=$H$11,12,F13=$H$12,13,F13=$H$13,25,F13=$H$14,60,F13=$H$15,68,F13=$H$16,69,F13=$H$17,106)","v":""}]
[null,null,null,{"$f":"_xlfn.IFS(F14=\"\",0,F14=$H$7,'Cost Data'!$D$677,F14=$H$8,'Cost Data'!$D$678,F14=$H$9,'Cost Data'!$D$679,F14=$H$10,'Cost Data'!$D$680,F14=$H$11,'Cost Data'!$D$681,F14=$H$12,'Cost Data'!$D$682,F14=$H$13,'Cost Data'!$D$683,F14=$H$14,'Cost Data'!$D$684,F14=$H$15,'Cost Data'!$D$685,F14=$H$16,'Cost Data'!$D$686,F14=$H$17,'Cost Data'!$D$687)","v":0},"Option 8",null,{"$f":"_xlfn.IFS($B$18=\"\",\" \",$B$18=$B$20,F27,$B$18=$B$24,G27,$B$18=$B$28,H27)","v":" "},"Viton O-Ring, Brown = -60",{"$f":"_xlfn.IFS(F14=\"\",\"\",F14=$H$7,\"01\",F14=$H$8,\"04\",F14=$H$9,\"06\",F14=$H$10,\"07\",F14=$H$11,12,F14=$H$12,13,F14=$H$13,25,F14=$H$14,60,F14=$H$15,68,F14=$H$16,69,F14=$H$17,106)","v":""}]
[null,null,null,{"$f":"_xlfn.IFS(F15=\"\",0,F15=$H$7,'Cost Data'!$D$677,F15=$H$8,'Cost Data'!$D$678,F15=$H$9,'Cost Data'!$D$679,F15=$H$10,'Cost Data'!$D$680,F15=$H$11,'Cost Data'!$D$681,F15=$H$12,'Cost Data'!$D$682,F15=$H$13,'Cost Data'!$D$683,F15=$H$14,'Cost Data'!$D$684,F15=$H$15,'Cost Data'!$D$685,F15=$H$16,'Cost Data'!$D$686,F15=$H$17,'Cost Data'!$D$687)","v":0},"Option 9",null,{"$f":"_xlfn.IFS($B$18=\"\",\" \",$B$18=$B$20,F28,$B$18=$B$24,\"\",$B$18=$B$28,H28)","v":" "},"Rotor with Kynar/Silicon Carbide Shaft = -68",{"$f":"_xlfn.IFS(F15=\"\",\"\",F15=$H$7,\"01\",F15=$H$8,\"04\",F15=$H$9,\"06\",F15=$H$10,\"07\",F15=$H$11,12,F15=$H$12,13,F15=$H$13,25,F15=$H$14,60,F15=$H$15,68,F15=$H$16,69,F15=$H$17,106)","v":""}]
[null,null,null,{"$f":"_xlfn.IFS(F16=\"\",0,F16=$H$7,'Cost Data'!$D$677,F16=$H$8,'Cost Data'!$D$678,F16=$H$9,'Cost Data'!$D$679,F16=$H$10,'Cost Data'!$D$680,F16=$H$11,'Cost Data'!$D$681,F16=$H$12,'Cost Data'!$D$682,F16=$H$13,'Cost Data'!$D$683,F16=$H$14,'Cost Data'!$D$684,F16=$H$15,'Cost Data'!$D$685,F16=$H$16,'Cost Data'!$D$686,F16=$H$17,'Cost Data'!$D$687)","v":0},"Option 10",null,{"$f":"_xlfn.IFS($B$18=\"\",\" \",$B$18=$B$20,F29,$B$18=$B$24,\"\",$B$18=$B$28,\"\")","v":" "},"EPDM O-Ring, Black = -69",{"$f":"_xlfn.IFS(F16=\"\",\"\",F16=$H$7,\"01\",F16=$H$8,\"04\",F16=$H$9,\"06\",F16=$H$10,\"07\",F16=$H$11,12,F16=$H$12,13,F16=$H$13,25,F16=$H$14,60,F16=$H$15,68,F16=$H$16,69,F16=$H$17,106)","v":""}]
[null,null,null,null,null,null,{"$f":"_xlfn.IFS($B$18=\"\",\" \",$B$18=$B$20,\"\",$B$18=$B$24,\"\",$B$18=$B$28,\"\")","v":" "},"Roytronic® Series-A 5-Pin Connector = -106"]
[null,null,"Please Select",null,null,{"$f":"_xlfn.TEXTJOIN(\"-\",TRUE,I7:I16)","v":""}]
[null,"Description","Size","SAE / BSP","Body Material","SPX Options","SPT Options","SES Options"]
["SPX","SPX","-038 = 3/8” (0.07–5 gpm) ","70 SAE Ports","Polypropylene &              Acrylic","Rotor w/ Ceramic Shaft, PVDF, Kynar = -01","Micropower Pickup = -04","Rotor with Ceramic Shaft, PVDF Kynar® = -01 "]
[null,null,"-050 = 1/2” (0.1–10 gpm) ","116 BSP Threads",null,"Micropower Pickup = -04","LMI 4-pin Connector = -06","Micropower Pickup = -04"]
[null,null,"-075 = 3/4” (0.2–20 gpm) ","NPT is default",null,"LMI 4-pin Connector = -06","Seametrics Control Connector = -07","LMI 4-pin Connector = -06"]
[null,null,"-100 = 1” (0.5–40 gpm)",null,null,"Seametrics Control Connector = -07","High Resolution = -13","Seametrics Control Connector = -07"]
["SPT","SPT","-038 = 3/8” (0.07–5 gpm) ","70 SAE Ports","Teflon","Polypro Cover = -12","Viton O-Ring, Brown = -60","High Resolution = -13"]
[null,null,"-050 = 1/2” (0.1–10 gpm) ","117 BSP Threads",null,"High Resolution = -13","Rotor with Kynar/Silicon Carbide Shaft = -68","Viton O-Ring, Brown = -60"]
[null,null,"-075 = 3/4” (0.2–20 gpm) ","NPT is default",null,"Viton O-Ring, Teflon-coated, Purple = -25","EPDM O-Ring, Black = -69","Rotor with Kynar/Silicon Carbide Shaft = -68"]
[null,null,"-100 = 1” (0.5–40 gpm)",null,null,"Viton O-Ring, Brown = -60","Roytronic® Series-A 5-Pin Connector = -106","EPDM O-Ring, Black = -69"]
["SES","SES","-050 = 1/2” (0.1–10 gpm) ","NPT is default","Stainless Steel","Rotor with Kynar/Silicon Carbide Shaft = -68",null,"Roytronic® Series-A 5-Pin Connector = -106"]
[null,null,"-075 = 3/4” (0.2–20 gpm) ",null,null,"Roytronic® Series-A 5-Pin Connector = -106"]
[null,null,"-100 = 1” (0.5–40 gpm)"]
[]
[]
["S-Series Parts & Accessories"]
["Model #",null,"Description",null,null,null,"Price"]
[100219,null,"O-Ring, Viton®, Brown (SPX)",null,null,null,{"$f":"'Cost Data'!D689","v":21}]
[100231,null,"Lens Assembly, Acrylic with Bearing, Pre-5/2005 (SPX)",null,null,null,{"$f":"'Cost Data'!D690","v":161}]
[100232,null,"Lens Assembly, Polypro with Bearing, Pre-5/2005 (SPX)",null,null,null,{"$f":"'Cost Data'!D691","v":179}]
[100264,null,"O-Ring, EPDM, Sensor Shaft",null,null,null,{"$f":"'Cost Data'!D692","v":17}]
[100372,null,"Tool, Bearing Removal, SPX/SPT/SES",null,null,null,{"$f":"'Cost Data'!D693","v":268}]
[100419,null,"Sensor Assy, Blue, Low Power, 18' (For External Powered Displays)",null,null,null,{"$f":"'Cost Data'!D694","v":118}]
[100451,null,"Cable, Unshielded, 3 Con, Blue, Low Power, IP-TX-WT-S Series (Per Ft.)",null,null,null,{"$f":"'Cost Data'!D695","v":3}]
[100453,null,"Rotor Repair Kit, Ceramic Shaft, 2 Magnet, High-Res",null,null,null,{"$f":"'Cost Data'!D696","v":282}]
[100508,null,"Sensor Assy, Grey Micropowered, 18' (For Battery Powered Displays)",null,null,null,{"$f":"'Cost Data'!D697","v":202}]
[100011,null,"Cable, Unshielded, 3 Con, Grey Micropower, IP-TX-WT-SPX, SPT, SES",null,null,null,{"$f":"'Cost Data'!D698","v":3}]
[100970,null,"Lens Assembly, Acrylic with Bearing, Post-5/2005 (SPX)",null,null,null,{"$f":"'Cost Data'!D699","v":129}]
[100971,null,"Lens Assembly, Polypro with Bearing, Post-5/2005 (SPX)",null,null,null,{"$f":"'Cost Data'!D700","v":151}]
[100973,null,"O-Ring, Viton® Teflon Coated, Purple (SES,SPT)",null,null,null,{"$f":"'Cost Data'!D701","v":41}]
[103308,null,"Kit, Capscrew 10-32 x 2\", Socket Head, SS (SPT)",null,null,null,{"$f":"'Cost Data'!D702","v":23}]
[103313,null,"Bearing Assembly Kit, SPX/SPT/SES (Includes 2 Bearings)",null,null,null,{"$f":"'Cost Data'!D703","v":83}]
[103314,null,"Kit, Screw, 10-24 x 1\", SS, S/H (SPX)",null,null,null,{"$f":"'Cost Data'!D704","v":23}]
[103318,null,"Screw Kit, 1/4-20 x 0.625\", SH, SS (SES)",null,null,null,{"$f":"'Cost Data'!D705","v":15}]
[103930,null,"Rotor Repair Kit, Ceramic Shaft, 2 Magnet, Low-Res",null,null,null,{"$f":"'Cost Data'!D706","v":248}]
[103931,null,"Rotor Repair Kit, Tungsten Carbide, 2 Magnet, Low-Res (SES,SPX)",null,null,null,{"$f":"'Cost Data'!D707","v":163}]
[103932,null,"Rotor Repair Kit, Tungsten Carbide, 6 Magnet, High-Res (SES,SPX)",null,null,null,{"$f":"'Cost Data'!D708","v":200}]
[103933,null,"Rotor Repair Kit, Silicon Carbide, 2 Magnet, Low-Res",null,null,null,{"$f":"'Cost Data'!D709","v":186}]
[103934,null,"Rotor Repair Kit, Silicon Carbide, 6 Magnet, High-Res",null,null,null,{"$f":"'Cost Data'!D710","v":270}]
["Cables & Connectors"]
["Model #",null,"Description",null,null,null,"Price"]
[100852,null,"Cable, Shielded, 4-Con, EX W/O Reverse Flow (Per Ft.)",null,null,null,{"$f":"'Cost Data'!D898","v":5}]
[100835,null,"Cable, Shielded, 6-Con, EX W/ Reverse Flow (Per Ft.)",null,null,null,{"$f":"'Cost Data'!D899","v":6}]
[100010,null,"Cable, Unshielded, 2 Con, MJ-WJ-AO55 (Per Ft.)",null,null,null,{"$f":"'Cost Data'!D900","v":3}]
[100451,null,"Cable, Unshielded, 3 Con, Blue, Low Power, IP-TX-WT-S Series (Per Ft.)",null,null,null,{"$f":"'Cost Data'!D901","v":3}]
[100011,null,"Cable, Unshielded, 3 Con, Grey Micropower (IP,TX,WT,SPX,SPT,SES)",null,null,null,{"$f":"'Cost Data'!D902","v":3}]
[100014,null,"Cable, Unshielded, 4 Con, FT440, (Per Ft.)",null,null,null,{"$f":"'Cost Data'!D903","v":4}]
[100649,null,"Cable, Unshielded, 3 Con, MJE (Per Ft.)",null,null,null,{"$f":"'Cost Data'!D904","v":3}]
[100008,null,"Connector, Female, LMI 4pin, Female",null,null,null,{"$f":"'Cost Data'!D905","v":40}]
[100006,null,"Connector, Seametrics 3-Pin BulkHead",null,null,null,{"$f":"'Cost Data'!D906","v":40}]
[100007,null,"Connector, Seametrics 3-Pin Cable End",null,null,null,{"$f":"'Cost Data'!D907","v":40}]
[101783,null,"Roytronics® Series-A Pump 5 Pin Connector",null,null,null,{"$f":"'Cost Data'!D908","v":41}]
[]
["Cables & Connectors Assemblies"]
["Model #",null,"Description",null,null,null,"Price"]
[100039,null,"Cable Assy, 12' Unshielded, 2 Con, LMI 4-Pin Connector",null,null,null,{"$f":"'Cost Data'!D910","v":54}]
[100013,null,"Cable Assy, 12' Unshielded, 3 Con, LMI 4-Pin Connector, 1K Resistor","Cable Assy, 12' Unshielded, 3 Con, LMI 4-Pin Connector, 1K Resistor","Cable Assy, 12' Unshielded, 3 Con, LMI 4-Pin Connector, 1K Resistor","Cable Assy, 12' Unshielded, 3 Con, LMI 4-Pin Connector, 1K Resistor",{"$f":"'Cost Data'!D911","v":54}]
[100395,null,"Cable Assy, 12' Unshielded, 2 Con, Seametrics 3-Pin Connector","Cable Assy, 12' Unshielded, 2 Con, Seametrics 3-Pin Connector","Cable Assy, 12' Unshielded, 2 Con, Seametrics 3-Pin Connector","Cable Assy, 12' Unshielded, 2 Con, Seametrics 3-Pin Connector",{"$f":"'Cost Data'!D912","v":54}]
[100041,null,"Cable Assy, 12' Unshielded, 3 Con, Seametrics 3-Pin Connector","Cable Assy, 12' Unshielded, 3 Con, Seametrics 3-Pin Connector","Cable Assy, 12' Unshielded, 3 Con, Seametrics 3-Pin Connector","Cable Assy, 12' Unshielded, 3 Con, Seametrics 3-Pin Connector",{"$f":"'Cost Data'!D913","v":54}]
[101587,null,"Cable Assy, 12' Unshielded, 2 Con, LMI 5-Pin Connector","Cable Assy, 12' Unshielded, 2 Con, LMI 5-Pin Connector","Cable Assy, 12' Unshielded, 2 Con, LMI 5-Pin Connector","Cable Assy, 12' Unshielded, 2 Con, LMI 5-Pin Connector",{"$f":"'Cost Data'!D914","v":54}]
[101576,null,"Cable Assy, 12' Unshielded, 3 Con, LMI 5-Pin Connector","Cable Assy, 12' Unshielded, 3 Con, LMI 5-Pin Connector","Cable Assy, 12' Unshielded, 3 Con, LMI 5-Pin Connector","Cable Assy, 12' Unshielded, 3 Con, LMI 5-Pin Connector",{"$f":"'Cost Data'!D915","v":54}]
[100044,null,"Sensor Assy, MJR, Single Reed Switch, LMI Pump 4-Pin Connector","Sensor Assy, MJR, Single Reed Switch, LMI Pump 4-Pin Connector","Sensor Assy, MJR, Single Reed Switch, LMI Pump 4-Pin Connector","Sensor Assy, MJR, Single Reed Switch, LMI Pump 4-Pin Connector",{"$f":"'Cost Data'!D916","v":113}]
[100045,null,"Sensor Assy, MJR, Dual Reed Switch, LMI Pump 4-Pin Connector","Sensor Assy, MJR, Dual Reed Switch, LMI Pump 4-Pin Connector","Sensor Assy, MJR, Dual Reed Switch, LMI Pump 4-Pin Connector","Sensor Assy, MJR, Dual Reed Switch, LMI Pump 4-Pin Connector",{"$f":"'Cost Data'!D917","v":123}]
[100049,null,"Sensor Assy, MJE, Single Hall Effect, LMI Pump 4-Pin Connector","Sensor Assy, MJE, Single Hall Effect, LMI Pump 4-Pin Connector","Sensor Assy, MJE, Single Hall Effect, LMI Pump 4-Pin Connector","Sensor Assy, MJE, Single Hall Effect, LMI Pump 4-Pin Connector",{"$f":"'Cost Data'!D918","v":113}]
[100046,null,"Sensor Assy, MJR, Single Reed Switch, Seametrics Control Connector","Sensor Assy, MJR, Single Reed Switch, Seametrics Control Connector","Sensor Assy, MJR, Single Reed Switch, Seametrics Control Connector","Sensor Assy, MJR, Single Reed Switch, Seametrics Control Connector",{"$f":"'Cost Data'!D919","v":113}]
[100047,null,"Sensor Assy, MJR, Dual Reed Switch, Seametrics Control Connector","Sensor Assy, MJR, Dual Reed Switch, Seametrics Control Connector","Sensor Assy, MJR, Dual Reed Switch, Seametrics Control Connector","Sensor Assy, MJR, Dual Reed Switch, Seametrics Control Connector",{"$f":"'Cost Data'!D920","v":123}]
[100048,null,"Sensor Assy, MJE, Single Hall Effect, Seametrics Control Cable","Sensor Assy, MJE, Single Hall Effect, Seametrics Control Cable","Sensor Assy, MJE, Single Hall Effect, Seametrics Control Cable","Sensor Assy, MJE, Single Hall Effect, Seametrics Control Cable",{"$f":"'Cost Data'!D921","v":113}]
[101588,null,"Sensor Assy, MJR, Single Reed Switch, LMI Pump 5-Pin Connector","Sensor Assy, MJR, Single Reed Switch, LMI Pump 5-Pin Connector","Sensor Assy, MJR, Single Reed Switch, LMI Pump 5-Pin Connector","Sensor Assy, MJR, Single Reed Switch, LMI Pump 5-Pin Connector",{"$f":"'Cost Data'!D922","v":113}]
[101589,null,"Sensor Assy, MJR, Dual Reed SW, LMI Pump 5-Pin Connector","Sensor Assy, MJR, Dual Reed SW, LMI Pump 5-Pin Connector","Sensor Assy, MJR, Dual Reed SW, LMI Pump 5-Pin Connector","Sensor Assy, MJR, Dual Reed SW, LMI Pump 5-Pin Connector",{"$f":"'Cost Data'!D923","v":113}]
[101590,null,"Sensor Assy, MJE, Single Hall Effect, LMI Pump 5-Pin Connector","Sensor Assy, MJE, Single Hall Effect, LMI Pump 5-Pin Connector","Sensor Assy, MJE, Single Hall Effect, LMI Pump 5-Pin Connector","Sensor Assy, MJE, Single Hall Effect, LMI Pump 5-Pin Connector",{"$f":"'Cost Data'!D924","v":123}]

{"sheet":"WT Series","index":14,"n_rows":100,"n_cols":9,"rows_kept":100,"cut":false,"hidden":false,"merged":[[63,2,63,5],[66,2,66,5],[24,2,24,5],[23,0,23,1],[23,2,23,5],[67,0,67,1],[67,2,67,5],[68,0,68,1],[68,2,68,5],[58,2,58,5],[62,0,62,1],[62,2,62,5],[64,0,64,1],[64,2,64,5],[65,0,65,1],[65,2,65,5],[59,0,59,1],[59,2,59,5],[60,0,60,1],[60,2,60,5],[61,0,61,1],[61,2,61,5],[55,0,55,1],[55,2,55,5],[56,0,56,1],[56,2,56,5],[57,0,57,1],[57,2,57,5],[52,0,52,1],[52,2,52,5],[53,0,53,1],[53,2,53,5],[54,0,54,1],[54,2,54,5],[49,0,49,1],[49,2,49,5],[50,0,50,1],[50,2,50,5],[51,0,51,1],[51,2,51,5],[45,0,45,1],[45,2,45,5],[46,0,46,1],[46,2,46,5],[47,0,47,1],[47,2,47,5],[48,2,48,5],[42,0,42,1],[42,2,42,5],[43,0,43,1],[43,2,43,5],[44,0,44,1],[44,2,44,5],[39,0,39,1],[39,2,39,5],[40,0,40,1],[40,2,40,5],[41,0,41,1],[41,2,41,5],[29,0,29,1],[29,2,29,5],[36,0,36,1],[36,2,36,5],[37,0,37,1],[37,2,37,5],[38,0,38,1],[38,2,38,5],[33,0,33,1],[33,2,33,5],[34,0,34,1],[34,2,34,5],[35,0,35,1],[35,2,35,5],[88,0,88,1],[88,2,88,5],[89,0,89,1],[89,2,89,5],[90,0,90,1],[90,2,90,5],[85,0,85,1],[85,2,85,5],[86,0,86,1],[86,2,86,5],[87,0,87,1],[87,2,87,5],[99,0,99,1],[99,2,99,5],[94,0,94,1],[94,2,94,5],[95,0,95,1],[95,2,95,5],[96,0,96,1],[96,2,96,5],[91,0,91,1],[91,2,91,5],[92,0,92,1],[92,2,92,5],[93,0,93,1],[93,2,93,5],[97,0,97,1],[97,2,97,5],[98,0,98,1],[98,2,98,5],[84,0,84,1],[84,2,84,5],[78,0,78,1],[78,2,78,5],[79,0,79,1],[79,2,79,5],[80,0,80,1],[80,2,80,5],[75,0,75,1],[75,2,75,5],[76,0,76,1],[76,2,76,5],[77,0,77,1],[77,2,77,5],[81,0,81,1],[81,2,81,5],[83,0,83,6],[72,0,72,1],[72,2,72,5],[73,0,73,1],[73,2,73,5],[74,0,74,1],[74,2,74,5],[70,0,70,1],[70,2,70,5],[71,0,71,1],[71,2,71,5],[69,2,69,5],[17,1,20,1],[17,4,20,4],[13,0,20,0],[1,2,1,5],[1,6,1,7],[3,4,3,6],[13,1,16,1],[13,4,16,4],[22,2,22,5],[25,0,25,1],[25,2,25,5],[26,0,26,1],[26,2,26,5],[30,0,30,1],[30,2,30,5],[31,0,31,1],[31,2,31,5],[32,0,32,1],[32,2,32,5],[27,0,27,1],[27,2,27,5],[28,0,28,1],[28,2,28,5]]}
[]
[{"$f":"_xlfn.TEXTJOIN(\"\",TRUE,B12,C12)","v":"Please Select"},{"$f":"_xlfn.TEXTJOIN(\"-\",TRUE,$A$2,D12)","v":"Please Select-Please Select"},{"$f":"F12","v":""},null,null,null,{"$f":"_xlfn.TEXTJOIN(\"-\",TRUE,B2,C2)","v":"Please Select-Please Select"}]
[null,"Meter","Options"]
["Costs",{"$f":"_xlfn.IFS(B2=\"WTP100-300\",'Cost Data'!$D$712,B2=\"WTP103-300\",'Cost Data'!$D$713,B2=\"WTP107-300\",'Cost Data'!$D$714,B2=\"WTP109-300\",'Cost Data'!$D$715,B2=\"WTP100-400\",'Cost Data'!$D$716,B2=\"WTP103-400\",'Cost Data'!$D$717,B2=\"WTP107-400\",'Cost Data'!$D$718, B2=\"WTP109-400\", 'Cost Data'!$D$719, B2=\"WTP100-600\", 'Cost Data'!$D$720, B2=\"WTP103-600\", 'Cost Data'!$D$721, B2=\"WTP107-600\", 'Cost Data'!$D$722, B2=\"WTP109-600\", 'Cost Data'!$D$723, B2=\"WTS100-300\", 'Cost Data'!$D$724, B2=\"WTS103-300\", 'Cost Data'!$D$725, B2=\"WTS107-300\", 'Cost Data'!$D$726, B2=\"WTS109-300\", 'Cost Data'!$D$727, B2=\"WTS100-400\", 'Cost Data'!$D$728, B2=\"WTS103-400\", 'Cost Data'!$D$729, B2=\"WTS107-400\", 'Cost Data'!$D$730, B2=\"WTS109-400\", 'Cost Data'!$D$731, B2=\"WTS100-600\", 'Cost Data'!$D$732, B2=\"WTS103-600\", 'Cost Data'!$D$733, B2=\"WTS107-600\", 'Cost Data'!$D$734, B2=\"WTS109-600\", 'Cost Data'!$D$735, B2=\"WTS100-800\", 'Cost Data'!$D$736, B2=\"WTS103-800\", 'Cost Data'!$D$737, B2=\"WTS107-800\", 'Cost Data'!$D$738, B2=\"WTS109-800\", 'Cost Data'!$D$739)","v":{"$error":"#N/A"}},{"$f":"SUM(D6:D11)","v":0},null,"Total",null,null,{"$f":"B4+C4","v":{"$error":"#N/A"}}]
[null,null,null,null,null,null,"Available Options","All Options"]
[null,null,null,{"$f":"_xlfn.IFS(F6=\"\",0,F6=$H$6,'Cost Data'!$D$740,F6=$H$9,'Cost Data'!$D$741,F6=$H$10,'Cost Data'!$D$742,F6=$H$11,'Cost Data'!$D$743, I6+$D$12=318, 'Cost Data'!$D$745, I6+$D$12=418, 'Cost Data'!$D$747,  I6+$D$12=618, 'Cost Data'!$D$749, I6+$D$12=314, 'Cost Data'!$D$744, I6+$D$12=414, 'Cost Data'!$D$746, I6+$D$12=614, 'Cost Data'!$D$748, I6+$D$12=814, 'Cost Data'!$D$750)","v":0},"Option 1",null,{"$f":"_xlfn.IFS($C$12=100,F14,$C$12<>100, \"\")","v":""},"Micropower Pickup (100 Series Only) = -04",{"$f":"_xlfn.IFS(F6=\"\",\"\",F6=$H$6,\"04\",F6=$H$7,\"14\",F6=$H$8,\"18\",F6=$H$9,\"64\",F6=$H$10,\"98\",F6=$H$11, \"126\")","v":""}]
[null,null,null,{"$f":"_xlfn.IFS(F7=\"\",0,F7=$H$6,'Cost Data'!$D$740,F7=$H$9,'Cost Data'!$D$741,F7=$H$10,'Cost Data'!$D$742,F7=$H$11,'Cost Data'!$D$743, I7+$D$12=318, 'Cost Data'!$D$745, I7+$D$12=418, 'Cost Data'!$D$747,  I7+$D$12=618, 'Cost Data'!$D$749, I7+$D$12=314, 'Cost Data'!$D$744, I7+$D$12=414, 'Cost Data'!$D$746, I7+$D$12=614, 'Cost Data'!$D$748, I7+$D$12=814, 'Cost Data'!$D$750)","v":0},"Option 2",null,{"$f":"_xlfn.IFS($B$12=$B$14,F15,$B$12=$B$18,G15)","v":{"$error":"#N/A"}},"All 316 SS = -14",{"$f":"_xlfn.IFS(F7=\"\",\"\",F7=$H$6,\"04\",F7=$H$7,\"14\",F7=$H$8,\"18\",F7=$H$9,\"64\",F7=$H$10,\"98\",F7=$H$11, \"126\")","v":""}]
[null,null,null,{"$f":"_xlfn.IFS(F8=\"\",0,F8=$H$6,'Cost Data'!$D$740,F8=$H$9,'Cost Data'!$D$741,F8=$H$10,'Cost Data'!$D$742,F8=$H$11,'Cost Data'!$D$743, I8+$D$12=318, 'Cost Data'!$D$745, I8+$D$12=418, 'Cost Data'!$D$747,  I8+$D$12=618, 'Cost Data'!$D$749, I8+$D$12=314, 'Cost Data'!$D$744, I8+$D$12=414, 'Cost Data'!$D$746, I8+$D$12=614, 'Cost Data'!$D$748, I8+$D$12=814, 'Cost Data'!$D$750)","v":0},"Option 3",null,{"$f":"_xlfn.IFS($C$12=103, F16, $C$12=107, F16, $C$12=109, F16, $C$12=100, \"\", C12=\"Please Select\", \"\")","v":""},"Flanged Ends = -18",{"$f":"_xlfn.IFS(F8=\"\",\"\",F8=$H$6,\"04\",F8=$H$7,\"14\",F8=$H$8,\"18\",F8=$H$9,\"64\",F8=$H$10,\"98\",F8=$H$11, \"126\")","v":""}]
[null,null,null,{"$f":"_xlfn.IFS(F9=\"\",0,F9=$H$6,'Cost Data'!$D$740,F9=$H$9,'Cost Data'!$D$741,F9=$H$10,'Cost Data'!$D$742,F9=$H$11,'Cost Data'!$D$743, I9+$D$12=318, 'Cost Data'!$D$745, I9+$D$12=418, 'Cost Data'!$D$747,  I9+$D$12=618, 'Cost Data'!$D$749, I9+$D$12=314, 'Cost Data'!$D$744, I9+$D$12=414, 'Cost Data'!$D$746, I9+$D$12=614, 'Cost Data'!$D$748, I9+$D$12=814, 'Cost Data'!$D$750)","v":0},"Option 4",null,{"$f":"_xlfn.IFS($C$12=103, F17, $C$12=107, \" \", $C$12=109, F17, $C$12=100, \"\", C12=\"Please Select\", \"\")","v":""},"Non-resettable Total = -64",{"$f":"_xlfn.IFS(F9=\"\",\"\",F9=$H$6,\"04\",F9=$H$7,\"14\",F9=$H$8,\"18\",F9=$H$9,\"64\",F9=$H$10,\"98\",F9=$H$11, \"126\")","v":""}]
[null,null,null,null,null,null,{"$f":"_xlfn.IFS($C$12=103, F18, $C$12=107, F18, $C$12=109, F18, $C$12=100, \"\", C12=\"Please Select\", \"\")","v":""},"Dual Relay Output (FT430/440 only) = -98"]
[null,null,null,null,null,null,null,"Hinged Display Cover Kit = -126"]
[null,null,"Please Select","Please Select",null,{"$f":"_xlfn.TEXTJOIN(\"-\",TRUE,I6:I11)","v":""}]
[null,"Description","Electronics","Size","Body Material","WTP Options","WTS Options"]
["WTP, WTS","WTP","Sensor Only (Pulse Output) = 100","3\"=-300","PVC","Micropower Pickup (100 Series Only) = -04","Micropower Pickup (100 Series Only) = -04"]
[null,null,"FT430 (Rate+Total/Pulse Scaled/Pulse Pass Through) = 103","4\"=-400",null,"Flanged Ends = -18","All 316 SS = -14"]
[null,null,"FT450(Battery-Powered/Pulse) = 107","6\"=-600",null,"Non-resettable Total = -64","Non-resettable Total = -64"]
[null,null,"FT440 (Rate+Total/Pulse Scaled/4-20mA) = 109",null,null,"Dual Relay Output (FT430/440 only) = -98","Dual Relay Output (FT430/440 only) = -98"]
[null,"WTS","Pulse Output = 100","3\"=-300","Stainless Steel","Hinged Display Cover Kit = -126","Hinged Display Cover Kit = -126"]
[null,null,"Rate+Total/Pulse Scaled/Pulse Pass Through = 103","4\"=-400"]
[null,null,"Battery-Powered/Pulse = 107","6\"=-600"]
[null,null,"Rate+Total/Pulse Scaled/4-20mA = 109","8\"=-800"]
[]
["WT Series Parts & Accessories"]
["Model #",null,"Description",null,null,null,"Price"]
[null,null,"Parts for all WT Meters"]
[100373,null,"Battery, Lithium, 3.6V, 8.5Ah, C Size",null,null,null,{"$f":"'Cost Data'!D752","v":67}]
[101850,null,"Strain Relief Kit Large, 1/2\", NPT",null,null,null,{"$f":"'Cost Data'!D753","v":21}]
[100364,null,"Strain Relief Kit, Small (Includes 2)",null,null,null,{"$f":"'Cost Data'!D754","v":36}]
[100262,null,"Flange, Blanking, SS, 3-8\"",null,null,null,{"$f":"'Cost Data'!D755","v":144}]
["103591-03",null,"FT450 Replacement Module",null,null,null,{"$f":"'Cost Data'!D756","v":551}]
["103591-02",null,"FT440 Replacement Module",null,null,null,{"$f":"'Cost Data'!D757","v":499}]
["103591-01",null,"FT430 Replacement Module",null,null,null,{"$f":"'Cost Data'!D758","v":420}]
[100411,null,"Gasket, Upper Housing",null,null,null,{"$f":"'Cost Data'!D759","v":16}]
[102021,null,"Hinged Display Cover Kit",null,null,null,{"$f":"'Cost Data'!D760","v":64}]
[100662,null,"Housing Assy, Upper, Blind (Gasket, Screws, Washers, Label)",null,null,null,{"$f":"'Cost Data'!D761","v":63}]
[100264,null,"O-Ring, EPDM, Sensor Shaft",null,null,null,{"$f":"'Cost Data'!D762","v":17}]
[100360,null,"Steel Housing Plug (Battery Units)",null,null,null,{"$f":"'Cost Data'!D763","v":21}]
[100152,null,"Rotor & Bearings Assy, WT, Kynar® (3\" - 8\" sizes only)",null,null,null,{"$f":"'Cost Data'!D764","v":331}]
[100333,null,"Rotor Repair Kit, WT, PVDF, Ceramic Shaft (3\" - 8\" sizes only)",null,null,null,{"$f":"'Cost Data'!D765","v":369}]
[100414,null,"Screw/Washer Kit, Upper Housing (Qty 4)",null,null,null,{"$f":"'Cost Data'!D766","v":3}]
[100853,null,"Security Seal, w/12\" of Wire",null,null,null,{"$f":"'Cost Data'!D767","v":5}]
[100419,null,"Sensor Assy, Blue, Low Power, 18' (For External Powered Displays)",null,null,null,{"$f":"'Cost Data'!D768","v":120}]
[100508,null,"Sensor Assy, Grey Micropowered, 18' (For Battery Powered Displays)",null,null,null,{"$f":"'Cost Data'!D769","v":202}]
[100298,null,"Sensor Retaining Screw",null,null,null,{"$f":"'Cost Data'!D770","v":39}]
[103312,null,"Shaft Assembly Kit, Ceramic, WT/TX (Includes 2 Shafts)",null,null,null,{"$f":"'Cost Data'!D771","v":145}]
[100375,null,"Spanner Tool, Sensor, Retain Screw",null,null,null,{"$f":"'Cost Data'!D772","v":70}]
[100154,null,"U-Clip, Retainer",null,null,null,{"$f":"'Cost Data'!D773","v":30}]
[100854,null,"Wire, for Security Seal, 12\" (For 3\" Only)",null,null,null,{"$f":"'Cost Data'!D774","v":3}]
[null,null,"For WTP Only"]
[100238,null,"Body, WTP-200-18",null,null,null,{"$f":"'Cost Data'!D775","v":476}]
[100239,null,"Body, WTP-300-18",null,null,null,{"$f":"'Cost Data'!D776","v":626}]
[100240,null,"Body, WTP-400-18",null,null,null,{"$f":"'Cost Data'!D777","v":789}]
[100241,null,"Body, WTP-600-18",null,null,null,{"$f":"'Cost Data'!D778","v":1090}]
[100437,null,"Insert Assy, WTP 2\"",null,null,null,{"$f":"'Cost Data'!D779","v":969}]
[100438,null,"Insert Assy, WTP 3\"",null,null,null,{"$f":"'Cost Data'!D780","v":1017}]
[100439,null,"Insert Assy, WTP 4\"- 6\"",null,null,null,{"$f":"'Cost Data'!D781","v":1096}]
[103309,null,"Kit, 1/4-20 x 1\" M/S, SS, WT",null,null,null,{"$f":"'Cost Data'!D782","v":15}]
[100214,null,"O-Ring, EPDM, Black",null,null,null,{"$f":"'Cost Data'!D783","v":21}]
[null,null,"For WTS Only"]
[100262,null,"Flange, Blanking, SS, 3-8\"",null,null,null,{"$f":"'Cost Data'!D784","v":144}]
[101446,null,"Insert Assy, WTC/WTS 2\"",null,null,null,{"$f":"'Cost Data'!D785","v":1040}]
[100440,null,"Insert Assy, WTS, 3\" to 8\"",null,null,null,{"$f":"'Cost Data'!D786","v":1175}]
[100270,null,"O-Ring, EPDM, Black",null,null,null,{"$f":"'Cost Data'!D787","v":24}]
[null,null,"For WT -200 meters purchased BEFORE January 1, 2011 Only"]
[100327,null,"Rotor, Kynar®, Ceramic Shaft",null,null,null,{"$f":"'Cost Data'!D788","v":322}]
[100325,null,"Rotor Repair Kit, TX, Kynar®, Ceramic Shaft (Rotor, Bearings, Shaft)",null,null,null,{"$f":"'Cost Data'!D789","v":362}]
[null,null,"For WT -200 meters purchased AFTER January 1, 2011 Only"]
[101862,null,"Rotor Assy, Kynar® w/ Carbide Shaft, TX",null,null,null,{"$f":"'Cost Data'!D790","v":163}]
[101912,null,"Rotor Repair Kit, TX, Kynar®, Carbide Shaft (Rotor, Bearings, Shaft)",null,null,null,{"$f":"'Cost Data'!D791","v":192}]
["Cables & Connectors"]
["Model #",null,"Description",null,null,null,"Price"]
[100852,null,"Cable, Shielded, 4-Con, EX W/O Reverse Flow (Per Ft.)",null,null,null,{"$f":"'Cost Data'!D898","v":5}]
[100835,null,"Cable, Shielded, 6-Con, EX W/ Reverse Flow (Per Ft.)",null,null,null,{"$f":"'Cost Data'!D899","v":6}]
[100010,null,"Cable, Unshielded, 2 Con, MJ-WJ-AO55 (Per Ft.)",null,null,null,{"$f":"'Cost Data'!D900","v":3}]
[100451,null,"Cable, Unshielded, 3 Con, Blue, Low Power, IP-TX-WT-S Series (Per Ft.)",null,null,null,{"$f":"'Cost Data'!D901","v":3}]
[100011,null,"Cable, Unshielded, 3 Con, Grey Micropower (IP,TX,WT,SPX,SPT,SES)",null,null,null,{"$f":"'Cost Data'!D902","v":3}]
[100014,null,"Cable, Unshielded, 4 Con, FT440, (Per Ft.)",null,null,null,{"$f":"'Cost Data'!D903","v":4}]
[100649,null,"Cable, Unshielded, 3 Con, MJE (Per Ft.)",null,null,null,{"$f":"'Cost Data'!D904","v":3}]
[100008,null,"Connector, Female, LMI 4pin, Female",null,null,null,{"$f":"'Cost Data'!D905","v":40}]
[100006,null,"Connector, Seametrics 3-Pin BulkHead",null,null,null,{"$f":"'Cost Data'!D906","v":40}]
[100007,null,"Connector, Seametrics 3-Pin Cable End",null,null,null,{"$f":"'Cost Data'!D907","v":40}]
[101783,null,"Roytronics® Series-A Pump 5 Pin Connector",null,null,null,{"$f":"'Cost Data'!D908","v":41}]
[]
["Cables & Connectors Assemblies"]
["Model #",null,"Description",null,null,null,"Price"]
[100039,null,"Cable Assy, 12' Unshielded, 2 Con, LMI 4-Pin Connector",null,null,null,{"$f":"'Cost Data'!D910","v":54}]
[100013,null,"Cable Assy, 12' Unshielded, 3 Con, LMI 4-Pin Connector, 1K Resistor","Cable Assy, 12' Unshielded, 3 Con, LMI 4-Pin Connector, 1K Resistor","Cable Assy, 12' Unshielded, 3 Con, LMI 4-Pin Connector, 1K Resistor","Cable Assy, 12' Unshielded, 3 Con, LMI 4-Pin Connector, 1K Resistor",{"$f":"'Cost Data'!D911","v":54}]
[100395,null,"Cable Assy, 12' Unshielded, 2 Con, Seametrics 3-Pin Connector","Cable Assy, 12' Unshielded, 2 Con, Seametrics 3-Pin Connector","Cable Assy, 12' Unshielded, 2 Con, Seametrics 3-Pin Connector","Cable Assy, 12' Unshielded, 2 Con, Seametrics 3-Pin Connector",{"$f":"'Cost Data'!D912","v":54}]
[100041,null,"Cable Assy, 12' Unshielded, 3 Con, Seametrics 3-Pin Connector","Cable Assy, 12' Unshielded, 3 Con, Seametrics 3-Pin Connector","Cable Assy, 12' Unshielded, 3 Con, Seametrics 3-Pin Connector","Cable Assy, 12' Unshielded, 3 Con, Seametrics 3-Pin Connector",{"$f":"'Cost Data'!D913","v":54}]
[101587,null,"Cable Assy, 12' Unshielded, 2 Con, LMI 5-Pin Connector","Cable Assy, 12' Unshielded, 2 Con, LMI 5-Pin Connector","Cable Assy, 12' Unshielded, 2 Con, LMI 5-Pin Connector","Cable Assy, 12' Unshielded, 2 Con, LMI 5-Pin Connector",{"$f":"'Cost Data'!D914","v":54}]
[101576,null,"Cable Assy, 12' Unshielded, 3 Con, LMI 5-Pin Connector","Cable Assy, 12' Unshielded, 3 Con, LMI 5-Pin Connector","Cable Assy, 12' Unshielded, 3 Con, LMI 5-Pin Connector","Cable Assy, 12' Unshielded, 3 Con, LMI 5-Pin Connector",{"$f":"'Cost Data'!D915","v":54}]
[100044,null,"Sensor Assy, MJR, Single Reed Switch, LMI Pump 4-Pin Connector","Sensor Assy, MJR, Single Reed Switch, LMI Pump 4-Pin Connector","Sensor Assy, MJR, Single Reed Switch, LMI Pump 4-Pin Connector","Sensor Assy, MJR, Single Reed Switch, LMI Pump 4-Pin Connector",{"$f":"'Cost Data'!D916","v":113}]
[100045,null,"Sensor Assy, MJR, Dual Reed Switch, LMI Pump 4-Pin Connector","Sensor Assy, MJR, Dual Reed Switch, LMI Pump 4-Pin Connector","Sensor Assy, MJR, Dual Reed Switch, LMI Pump 4-Pin Connector","Sensor Assy, MJR, Dual Reed Switch, LMI Pump 4-Pin Connector",{"$f":"'Cost Data'!D917","v":123}]
[100049,null,"Sensor Assy, MJE, Single Hall Effect, LMI Pump 4-Pin Connector","Sensor Assy, MJE, Single Hall Effect, LMI Pump 4-Pin Connector","Sensor Assy, MJE, Single Hall Effect, LMI Pump 4-Pin Connector","Sensor Assy, MJE, Single Hall Effect, LMI Pump 4-Pin Connector",{"$f":"'Cost Data'!D918","v":113}]
[100046,null,"Sensor Assy, MJR, Single Reed Switch, Seametrics Control Connector","Sensor Assy, MJR, Single Reed Switch, Seametrics Control Connector","Sensor Assy, MJR, Single Reed Switch, Seametrics Control Connector","Sensor Assy, MJR, Single Reed Switch, Seametrics Control Connector",{"$f":"'Cost Data'!D919","v":113}]
[100047,null,"Sensor Assy, MJR, Dual Reed Switch, Seametrics Control Connector","Sensor Assy, MJR, Dual Reed Switch, Seametrics Control Connector","Sensor Assy, MJR, Dual Reed Switch, Seametrics Control Connector","Sensor Assy, MJR, Dual Reed Switch, Seametrics Control Connector",{"$f":"'Cost Data'!D920","v":123}]
[100048,null,"Sensor Assy, MJE, Single Hall Effect, Seametrics Control Cable","Sensor Assy, MJE, Single Hall Effect, Seametrics Control Cable","Sensor Assy, MJE, Single Hall Effect, Seametrics Control Cable","Sensor Assy, MJE, Single Hall Effect, Seametrics Control Cable",{"$f":"'Cost Data'!D921","v":113}]
[101588,null,"Sensor Assy, MJR, Single Reed Switch, LMI Pump 5-Pin Connector","Sensor Assy, MJR, Single Reed Switch, LMI Pump 5-Pin Connector","Sensor Assy, MJR, Single Reed Switch, LMI Pump 5-Pin Connector","Sensor Assy, MJR, Single Reed Switch, LMI Pump 5-Pin Connector",{"$f":"'Cost Data'!D922","v":113}]
[101589,null,"Sensor Assy, MJR, Dual Reed SW, LMI Pump 5-Pin Connector","Sensor Assy, MJR, Dual Reed SW, LMI Pump 5-Pin Connector","Sensor Assy, MJR, Dual Reed SW, LMI Pump 5-Pin Connector","Sensor Assy, MJR, Dual Reed SW, LMI Pump 5-Pin Connector",{"$f":"'Cost Data'!D923","v":113}]
[101590,null,"Sensor Assy, MJE, Single Hall Effect, LMI Pump 5-Pin Connector","Sensor Assy, MJE, Single Hall Effect, LMI Pump 5-Pin Connector","Sensor Assy, MJE, Single Hall Effect, LMI Pump 5-Pin Connector","Sensor Assy, MJE, Single Hall Effect, LMI Pump 5-Pin Connector",{"$f":"'Cost Data'!D924","v":123}]

{"sheet":"AG3000","index":15,"n_rows":119,"n_cols":11,"rows_kept":119,"cut":false,"hidden":true,"merged":[[117,1,117,2],[117,3,117,9],[118,1,118,2],[118,3,118,9],[114,1,114,2],[114,3,114,9],[115,1,115,2],[115,3,115,9],[116,1,116,2],[116,3,116,9],[111,1,111,10],[112,1,112,2],[112,3,112,9],[113,1,113,2],[113,3,113,9],[110,1,110,2],[110,3,110,9],[107,1,107,2],[107,3,107,9],[108,1,108,2],[108,3,108,9],[109,1,109,2],[109,3,109,9],[104,1,104,2],[104,3,104,9],[105,1,105,2],[105,3,105,9],[106,1,106,2],[106,3,106,9],[100,1,100,2],[100,3,100,9],[102,1,102,2],[102,3,102,9],[103,1,103,10],[101,1,101,2],[101,3,101,9],[97,1,97,2],[97,3,97,9],[98,1,98,2],[98,3,98,9],[99,1,99,2],[99,3,99,9],[94,1,94,2],[94,3,94,9],[95,1,95,2],[95,3,95,9],[96,1,96,2],[96,3,96,9],[91,1,91,2],[91,3,91,9],[92,1,92,2],[92,3,92,9],[93,1,93,2],[93,3,93,9],[88,1,88,2],[88,3,88,9],[89,1,89,2],[89,3,89,9],[90,1,90,2],[90,3,90,9],[85,1,85,2],[85,3,85,9],[86,1,86,2],[86,3,86,9],[87,1,87,2],[87,3,87,9],[82,1,82,2],[82,3,82,9],[83,1,83,2],[83,3,83,9],[84,1,84,2],[84,3,84,9],[79,1,79,2],[79,3,79,9],[80,1,80,2],[80,3,80,9],[81,1,81,2],[81,3,81,9],[76,1,76,2],[76,3,76,9],[77,1,77,2],[77,3,77,9],[78,1,78,2],[78,3,78,9],[73,1,73,2],[73,3,73,9],[74,1,74,2],[74,3,74,9],[75,1,75,2],[75,3,75,9],[70,1,70,2],[70,3,70,9],[71,1,71,2],[71,3,71,9],[72,1,72,2],[72,3,72,9],[67,1,67,2],[67,3,67,9],[68,1,68,2],[68,3,68,9],[69,1,69,2],[69,3,69,9],[64,1,64,2],[64,3,64,9],[65,1,65,2],[65,3,65,9],[66,1,66,2],[66,3,66,9],[61,1,61,10],[62,1,62,2],[62,3,62,9],[63,1,63,2],[63,3,63,9],[21,0,28,0],[23,4,25,4],[26,4,28,4],[36,4,36,8],[57,4,57,8],[1,0,9,0],[3,4,6,4],[7,4,9,4],[11,1,11,9],[12,1,12,9],[52,1,52,9],[53,1,53,9],[57,1,57,2],[15,1,15,4],[35,1,35,5],[56,1,56,5],[31,1,31,9],[32,1,32,9],[36,1,36,2],[41,0,50,0],[43,4,46,4],[47,4,50,4],[16,1,16,2],[16,4,16,8]]}
[null,"AG3000",{"$f":"_xlfn.IFS(C3=2,\"0200\",C3=3,\"0300\",C3=4,\"0400\",C3=6,\"0600\",C3=8,\"0800\",C3=10,\"1000\",C3=12,\"1200\")","v":{"$error":"#N/A"}},"F1",{"$f":"_xlfn.IFS(E3=\"DC\", \"D1\", E3=\"Battery\", \"BX\")","v":{"$error":"#N/A"}},{"$f":"_xlfn.IFS(F3= \"Please Select\", \"#N/A\",F3=\"No Optional Output Connector\", \"X\",F3= \"_4_20mA Connector\", \"L\",F3= \"Modbus\", \"S\",F3=\"Modbus Connector\", \"S\")","v":"#N/A"},{"$f":"IF(G3=\"Yes\", \"01\", \"XX\")","v":"XX"},{"$f":"_xlfn.IFS(H3=\".-0064\", \"0064\",H3=\".-0154\", \"0154\",H3= \".-0304\", \"0304\",H3= \".-0454\", \"0454\",H3= \".-0604\", \"0604\",H3=\".-0068\", \"0068\",H3=\".-0158\", \"0158\",H3= \".-0308\", \"0308\",H3= \".-0458\", \"0458\",H3= \".-0608\", \"0608\",H3=0,\"0000\")","v":{"$error":"#N/A"}}]
["AG3000    (Integrated Display)",null,"Size","Style","Power","Optional output (Pulse is standard)","Data Logger","Cables"]
[null,null,null,"F1",null,"Please Select",null,"Please Select"]
[null,null,".-0200 2\"",".-F1",".-D1 - DC",".-X (Single Cable for DC Power & output)",".-XX None","006X = 6m (20ft)"]
[null,null,".-0300 3\"",null,null,".-L (Single Cable for DC Power & output)",".-01 Data Logger","015X = 15m (50ft)"]
[null,null,".-0400 4\"",null,null,".-S (Dual Cable for DC Power & output)",null,"030X = 30m (100ft)"]
[null,null,".-0600 6\"",null,null,null,null,"045X = 45m (150ft)"]
[null,null,".-0800 8\"",null,".-BX - Battery",null,null,"060X = 60m (200ft)"]
[null,null,".-1000 10\"",null,null,".-X (requires 4 conductor cable)",null,"X could 4 or 8 "]
[null,null,".-1200 12\"",null,null,".-S (requires 8 conductor cable)",null,"depending on output"]
[]
[null,"BASE MODEL"]
[null,{"$f":"_xlfn.TEXTJOIN(\"-\",TRUE,B1:H1)","v":{"$error":"#N/A"}}]
[null,null,"Meter ",null,"Power","Optional Output","Data Logger","Output Cable",null,"List Price"]
[null,"Meter",{"$f":"_xlfn.IFS(C3=2,'Cost Data'!D792, C3=3,'Cost Data'!D793, C3=4,'Cost Data'!D794, C3=6,'Cost Data'!D795,C3=8,'Cost Data'!D796,C3=10,'Cost Data'!D797,C3=12,'Cost Data'!D798 )","v":{"$error":"#N/A"}},null,0,{"$f":"_xlfn.IFS(F1=\"L\",'Cost Data'!D799,F1=\"H\",'Cost Data'!D800,F1= \"S\",'Cost Data'!D801,F1= \"X\",0)","v":{"$error":"#N/A"}},{"$f":"IF(G1=\"01\",'Cost Data'!D802,0)","v":0},{"$f":"_xlfn.IFS(H1=\"0068\",'Cost Data'!D803,H1=\"0158\",'Cost Data'!D804,H1=\"0308\",'Cost Data'!D805,H1=\"0458\",'Cost Data'!D806,H1=\"0608\",'Cost Data'!D807,H1=\"0064\",'Cost Data'!D808,H1=\"0154\",'Cost Data'!D809,H1=\"0304\",'Cost Data'!D810,H1=\"0454\",'Cost Data'!D811,H1=\"0604\",'Cost Data'!D812,H1=\"0000\",0)","v":{"$error":"#N/A"}},null,{"$f":"(C15+E15+F15+G15+H15)","v":{"$error":"#N/A"}}]
[null,{"$f":"B13","v":{"$error":"#N/A"}}]
[null,{"$f":"_xlfn.IFS(C3=2, 'Cost Data'!B989, C3=3, 'Cost Data'!B990, C3=4,'Cost Data'!B991,C3=6,'Cost Data'!B992,C3=8,'Cost Data'!B992,C3=10,'Cost Data'!B994,C3=12,'Cost Data'!B995)","v":{"$error":"#N/A"}},null,null,{"$f":"_xlfn.IFS(C3=2, 'Cost Data'!C989,C3=3, 'Cost Data'!C990,C3=4,'Cost Data'!C991,C3=6,'Cost Data'!C992,C3=8,'Cost Data'!C993,C3=10,'Cost Data'!C994,C3=12,'Cost Data'!C995)","v":{"$error":"#N/A"}},null,null,null,null,{"$f":"_xlfn.IFS(C3=2, 'Cost Data'!D989,C3=3, 'Cost Data'!D990,C3=4,'Cost Data'!D991,C3=6,'Cost Data'!D992,C3=8,'Cost Data'!D993,C3=10,'Cost Data'!D994,C3=12,'Cost Data'!D995)","v":{"$error":"#N/A"}}]
[null,null,null,null,null,null,null,null,"Total",{"$f":"J15+J17","v":{"$error":"#N/A"}}]
[]
[]
[null,"AG3000p",{"$f":"_xlfn.IFS(C23=3,\"0300\",C23=4,\"0400\",C23=6,\"0600\",C23=8,\"0800\",C23=10,\"1000\",C23=12,\"1200\", C23=2, \"0200\")","v":{"$error":"#N/A"}},"F1",{"$f":"_xlfn.IFS(E23=\"D.C.\", \"D1\", E23=\"A.C.\", \"A1\")","v":{"$error":"#N/A"}},{"$f":"_xlfn.IFS(F23=\"No Optional Output\", \"X\",F23= \"Fourto20mA\", \"L\",F23= \"DC_Modbus\", \"S\",F23= \"HART\", \"H\",F23= \"AC_Modbus\", \"S\")","v":{"$error":"#N/A"}},{"$f":"IF(G23=\"Yes\", \"01\", \"XX\")","v":"XX"},{"$f":"_xlfn.IFS(H23=\".-006S\",\"006S\",H23=\".-015S\",\"015S\",H23=\".-030S\",\"030S\",H23=\".-045S\",\"045S\",H23=\".-060S\",\"060S\",H23=\".-006D\",\"006D\",H23=\".-015D\",\"015D\",H23=\".-030D\",\"030D\",H23=\".-045D\",\"045D\",H23=\".-060D\",\"060D\",H23=0,\"0000\")","v":{"$error":"#N/A"}}]
["AG3000P    (Integrated Display)",null,"Size","Style","Power","Please Select","Datalogger","Cables"]
[null,null,null,"F1",null,"Please Select",null,"Please Select"]
[null,null,".-0200 2\"",".-F1",".-D1 - DC",".-X (Single Cable for DC Power & output)",".-XX None","6m (20ft)"]
[null,null,".-0300 3\"",null,null,".-H (Single Cable for DC Power & output)",".-01 Data Logger","15m (50ft)"]
[null,null,".-0400 4\"",null,null,".-S (Dual Cable for DC Power & output)",null,"30m (100ft)"]
[null,null,".-0600 6\"",null,".-A1 - AC",".-X (Single Cable for output)",null,"45m (150ft)"]
[null,null,".-0800 8\"",null,null,".-H (Single Cable for output)",null,"60m (200ft)"]
[null,null,".-1000 10\"",null,null,".-S  (Single Cable for output)"]
[null,null,".-1200 12\""]
[]
[null,"PREMIUM MODEL"]
[null,{"$f":"_xlfn.TEXTJOIN(\"-\",TRUE,B21:H21)","v":{"$error":"#N/A"}}]
[null,null,"Meter ",null,"Power","Optional Output","Data Logger","Output Cable",null,"List Price"]
[null,"Meter",{"$f":"_xlfn.IFS(C23=2, 'Cost Data'!D813, C23=3, 'Cost Data'!D814, C23=4, 'Cost Data'!D815, C23=6,'Cost Data'!D816,C23=8,'Cost Data'!D817,C23=10,'Cost Data'!D818,C23=12,'Cost Data'!D819)","v":{"$error":"#N/A"}},null,{"$f":"IF(E23=\"A.C.\", 126,0)","v":0},{"$f":"_xlfn.IFS(F21=\"H\",'Cost Data'!D821,F21= \"S\",'Cost Data'!D822,F21= \"X\",0)","v":{"$error":"#N/A"}},{"$f":"IF(G21=\"01\", 'Cost Data'!D823,0)","v":0},{"$f":"_xlfn.IFS(H21=\"006D\",'Cost Data'!D824,H21=\"015D\",'Cost Data'!D825,H21=\"030D\",'Cost Data'!D826,H21=\"045D\",'Cost Data'!D827,H21=\"060D\",'Cost Data'!D828,H21=\"006S\",'Cost Data'!D829,H21=\"015S\",'Cost Data'!D830,H21=\"030S\",'Cost Data'!D831,H21=\"045S\",'Cost Data'!D832,H21=\"060S\",'Cost Data'!D833,H21=\"0000\",0)","v":{"$error":"#N/A"}},null,{"$f":"(C35+E35+F35+G35+H35)","v":{"$error":"#N/A"}}]
[null,{"$f":"B33","v":{"$error":"#N/A"}}]
[null,{"$f":"_xlfn.IFS(C23=2, 'Cost Data'!B989, C23=3, 'Cost Data'!B990, C23=4,'Cost Data'!B991,C23=6,'Cost Data'!B992,C23=8,'Cost Data'!B992,C23=10,'Cost Data'!B994,C23=12,'Cost Data'!B995)","v":{"$error":"#N/A"}},null,null,{"$f":"_xlfn.IFS(C23=2, 'Cost Data'!C989,C23=3, 'Cost Data'!C990,C23=4,'Cost Data'!C991,C23=6,'Cost Data'!C992,C23=8,'Cost Data'!C993,C23=10,'Cost Data'!C994,C23=12,'Cost Data'!C995)","v":{"$error":"#N/A"}},null,null,null,null,{"$f":"_xlfn.IFS(C23=2, 'Cost Data'!D989,C23=3, 'Cost Data'!D990,C23=4,'Cost Data'!D991,C23=6,'Cost Data'!D992,C23=8,'Cost Data'!D993,C23=10,'Cost Data'!D994,C23=12,'Cost Data'!D995)","v":{"$error":"#N/A"}}]
[null,null,null,null,null,null,null,null,null,{"$f":"J35+J37","v":{"$error":"#N/A"}}]
[]
[]
[null,"AG3000r",{"$f":"_xlfn.IFS(C43=2,\"-0200\",C43=3,\"-0300\",C43=4,\"-0400\",C43=6,\"-0600\",C43=8,\"-0800\",C43=10,\"-1000\",C3=12,\"-1200\")","v":{"$error":"#N/A"}},"-F1",{"$f":"_xlfn.IFS(E43=\"DC_remote\", \"-D1\", E43=\"AC_remote\", \"-A1\")","v":{"$error":"#N/A"}},{"$f":"_xlfn.IFS(F43=\"No Optional Output\", \"-X\",F43= \"_4_20mA\", \"-L\",F43= \"Modbus\", \"-S\",F43= \"HART\", \"-H\",F43= \"AC_Modbus\", \"-S\")","v":{"$error":"#N/A"}},{"$f":"IF(G43=\"Yes\", \"-01\", \"-XX\")","v":"-XX"},{"$f":"_xlfn.IFS(H43=\".-006S\",\"-006S\",H43=\".-015S\",\"-015S\",H43=\".-030S\",\"-030S\",H43=\".-045S\",\"-045S\",H43=\".-060S\",\"-060S\",H43=\".-006D\",\"-006D\",H43=\".-015D\",\"-015D\",H43=\".-030D\",\"-030D\",H43=\".-045D\",\"-045D\",H43=\".-060D\",\"-060D\",H43=0,\"-0000\")","v":{"$error":"#N/A"}},{"$f":"_xlfn.IFS(I43=\".-006\", \"-006\",I43=\".-015\", \"-015\",I43= \".-030\", \"-030\",I43= \".-045\", \"-045\",I43= \".-060\", \"-060\")","v":{"$error":"#N/A"}}]
["AG3000r                   (Remote Display)",null,"Size","Style","Power","Optional output (Pulse is standard)","Data Logger","Cables","Remote Cable"]
[null,null,null,"F1",null,"Please Select",null,"Please Select"]
[null,null,".-0200 2\"",".-F1",".-D1 - DC",".-X (Single Cable for DC Power & output)",".-XX None","6m (20ft)","6m (20ft)"]
[null,null,".-0300 3\"",null,null,".-L (Single Cable for DC Power & output)",".-01 Data Logger","15m (50ft)","15m (50ft)"]
[null,null,".-0400 4\"",null,null,".-H (Single Cable for DC Power & output)",null,"30m (100ft)","30m (100ft)"]
[null,null,".-0600 6\"",null,null,".-S (Dual Cable for DC Power & output)",null,"45m (150ft)","45m (150ft)"]
[null,null,".-0800 8\"",null,".-A1 - AC",".-X (Single Cable for output)",null,"60m (200ft)","60m (200ft)"]
[null,null,".-1000 10\"",null,null,".-L (Single Cable for output)"]
[null,null,".-1200 12\"",null,null,".-H (Single Cable for output)"]
[null,null,null,null,null,".-S  (Single Cable for output)"]
[]
[null,"REMOTE MODEL"]
[null,{"$f":"_xlfn.TEXTJOIN(\"\",TRUE,B41:I41)","v":{"$error":"#N/A"}}]
[null,null,"Meter ",null,"Power","Optional Output","Data Logger","Output Cable","Remote Cable","List Price"]
[null,"Meter",{"$f":"_xlfn.IFS(C43=2, 'Cost Data'!D834, C43=3, 'Cost Data'!D835, C43=4, 'Cost Data'!D836, C43=6,'Cost Data'!D837,C43=8,'Cost Data'!D838,C43=10,'Cost Data'!D839,C43=12,'Cost Data'!D840)","v":{"$error":"#N/A"}},null,{"$f":"IF(E43=\"AC_remote\", 126,0)","v":0},{"$f":"_xlfn.IFS(F41=\"-L\",'Cost Data'!D842,F41=\"-H\",'Cost Data'!D843,F41= \"-S\",'Cost Data'!D844,F41= \"-X\",0)","v":{"$error":"#N/A"}},{"$f":"IF(G41=\"-01\", 'Cost Data'!D845,0)","v":0},{"$f":"_xlfn.IFS(H41=\"-006D\",'Cost Data'!D846,H41=\"-015D\",'Cost Data'!D847,H41=\"-030D\",'Cost Data'!D848,H41=\"-045D\",'Cost Data'!D849,H41=\"-060D\",'Cost Data'!D850,H41=\"-006S\",'Cost Data'!D851,H41=\"-015S\",'Cost Data'!D852,H41=\"-030S\",'Cost Data'!D853,H41=\"-045S\",'Cost Data'!D854,H41=\"-060S\",'Cost Data'!D855,H41=\"-0000\",0)","v":{"$error":"#N/A"}},{"$f":"_xlfn.IFS(I41=\"-006\",'Cost Data'!D856,I41=\"-015\",'Cost Data'!D857,I41=\"-030\",'Cost Data'!D858,I41=\"-045\",'Cost Data'!D859,I41=\"-060\",'Cost Data'!D860,I41=0,”Must Have Cable”)","v":{"$error":"#N/A"}},{"$f":"(C56+E56+F56+G56+H56+I56)","v":{"$error":"#N/A"}}]
[null,{"$f":"B54","v":{"$error":"#N/A"}}]
[null,{"$f":"_xlfn.IFS(C43=2, 'Cost Data'!B989, C43=3, 'Cost Data'!B990, C43=4,'Cost Data'!B991,C43=6,'Cost Data'!B992,C43=8,'Cost Data'!B992,C43=10,'Cost Data'!B994,C43=12,'Cost Data'!B995)","v":{"$error":"#N/A"}},null,null,{"$f":"_xlfn.IFS(C43=2, 'Cost Data'!C989,C43=3, 'Cost Data'!C990,C43=4,'Cost Data'!C991,C43=6,'Cost Data'!C992,C43=8,'Cost Data'!C993,C43=10,'Cost Data'!C994,C43=12,'Cost Data'!C995)","v":{"$error":"#N/A"}},null,null,null,null,{"$f":"_xlfn.IFS(C43=2, 'Cost Data'!D989,C43=3, 'Cost Data'!D990,C43=4,'Cost Data'!D991,C43=6,'Cost Data'!D992,C43=8,'Cost Data'!D993,C43=10,'Cost Data'!D994,C43=12,'Cost Data'!D995)","v":{"$error":"#N/A"}}]
[null,null,null,null,null,null,null,null,null,{"$f":"J56+J58","v":{"$error":"#N/A"}}]
[]
[]
[null,"AG3000 Parts & Accessories"]
[null,"Model #",null,"Description",null,null,null,null,null,null,"Price"]
[null,{"$f":"'Cost Data'!B932","v":"104094-015"},null,{"$f":"'Cost Data'!C932","v":"DC Power/Output or Sensor Cable, 15 Meter (50 ft.), 4 Pin"},null,null,null,null,null,null,{"$f":"'Cost Data'!D932","v":171}]
[null,{"$f":"'Cost Data'!B933","v":"104094-030"},null,{"$f":"'Cost Data'!C933","v":"DC Power/Output or Sensor Cable, 30 Meter (100 ft.), 4 Pin"},null,null,null,null,null,null,{"$f":"'Cost Data'!D933","v":284}]
[null,{"$f":"'Cost Data'!B934","v":"104094-045"},null,{"$f":"'Cost Data'!C934","v":"DC Power/Output or Sensor Cable, 45 Meter (150 ft.), 4 Pin"},null,null,null,null,null,null,{"$f":"'Cost Data'!D934","v":404}]
[null,{"$f":"'Cost Data'!B935","v":"104094-060"},null,{"$f":"'Cost Data'!C935","v":"DC Power/Output or Sensor Cable, 60 Meter (200 ft.), 4 Pin"},null,null,null,null,null,null,{"$f":"'Cost Data'!D935","v":525}]
[null,{"$f":"'Cost Data'!#REF!","v":{"$error":"#REF!"}},null,{"$f":"'Cost Data'!#REF!","v":{"$error":"#REF!"}},null,null,null,null,null,null,{"$f":"'Cost Data'!#REF!","v":{"$error":"#REF!"}}]
[null,{"$f":"'Cost Data'!B936","v":"103706-006"},null,{"$f":"'Cost Data'!C936","v":"DC Power/Output Cable, 6 Meter (20 ft.), 8 Con"},null,null,null,null,null,null,{"$f":"'Cost Data'!D936","v":109}]
[null,{"$f":"'Cost Data'!B937","v":"103706-015"},null,{"$f":"'Cost Data'!C937","v":"DC Power/Output Cable, 15 Meter (50 ft.), 8 Con"},null,null,null,null,null,null,{"$f":"'Cost Data'!D937","v":196}]
[null,{"$f":"'Cost Data'!B938","v":"103706-030"},null,{"$f":"'Cost Data'!C938","v":"DC Power/Output Cable, 30 Meter (100 ft.), 8 Con"},null,null,null,null,null,null,{"$f":"'Cost Data'!D938","v":338}]
[null,{"$f":"'Cost Data'!B939","v":"103706-045"},null,{"$f":"'Cost Data'!C939","v":"DC Power/Output Cable, 45 Meter (150 ft.), 8 Con"},null,null,null,null,null,null,{"$f":"'Cost Data'!D939","v":482}]
[null,{"$f":"'Cost Data'!B940","v":"103706-060"},null,{"$f":"'Cost Data'!C940","v":"DC Power/Output Cable, 60 Meter (200 ft.), 8 Con"},null,null,null,null,null,null,{"$f":"'Cost Data'!D940","v":625}]
[null,{"$f":"'Cost Data'!B941","v":103701},null,{"$f":"'Cost Data'!C941","v":"AC Power/Output Cable 1.8 Meter (6 ft.), Includes wall outlet plug"},null,null,null,null,null,null,{"$f":"'Cost Data'!D941","v":15}]
[null,{"$f":"'Cost Data'!B942","v":"103149-006"},null,{"$f":"'Cost Data'!C942","v":"AC Power/Output Cable 6 Meter (20 ft.), Cable Only"},null,null,null,null,null,null,{"$f":"'Cost Data'!D942","v":46}]
[null,{"$f":"'Cost Data'!B943","v":"103149-015"},null,{"$f":"'Cost Data'!C943","v":"AC Power/Output Cable 15 Meter (50 ft.), Cable Only"},null,null,null,null,null,null,{"$f":"'Cost Data'!D943","v":114}]
[null,{"$f":"'Cost Data'!B944","v":"103149-030"},null,{"$f":"'Cost Data'!C944","v":"AC Power/Output Cable 30 Meter (100 ft.), Cable Only"},null,null,null,null,null,null,{"$f":"'Cost Data'!D944","v":229}]
[null,{"$f":"'Cost Data'!B945","v":"103149-045"},null,{"$f":"'Cost Data'!C945","v":"AC Power/Output Cable 45 Meter (150 ft.), Cable Only"},null,null,null,null,null,null,{"$f":"'Cost Data'!D945","v":343}]
[null,{"$f":"'Cost Data'!B946","v":"103149-060"},null,{"$f":"'Cost Data'!C946","v":"AC Power/Output Cable 60 Meter (200 ft.), Cable Only"},null,null,null,null,null,null,{"$f":"'Cost Data'!D946","v":459}]
[null,{"$f":"'Cost Data'!B948","v":"102157 (1)"},null,{"$f":"'Cost Data'!C948","v":"Grounding Ring, Magmeter, 3\""},null,null,null,null,null,null,{"$f":"'Cost Data'!D948","v":119}]
[null,{"$f":"'Cost Data'!B949","v":"100876 (1)"},null,{"$f":"'Cost Data'!C949","v":"Grounding Ring, Magmeter, 4\""},null,null,null,null,null,null,{"$f":"'Cost Data'!D949","v":126}]
[null,{"$f":"'Cost Data'!B950","v":"100877 (1)"},null,{"$f":"'Cost Data'!C950","v":"Grounding Ring, Magmeter 6\""},null,null,null,null,null,null,{"$f":"'Cost Data'!D950","v":132}]
[null,{"$f":"'Cost Data'!B951","v":"100878 (1)"},null,{"$f":"'Cost Data'!C951","v":"Grounding Ring, Magmeter 8\""},null,null,null,null,null,null,{"$f":"'Cost Data'!D951","v":141}]
[null,{"$f":"'Cost Data'!B952","v":"100879 (1)"},null,{"$f":"'Cost Data'!C952","v":"Grounding Ring, Magmeter 10\""},null,null,null,null,null,null,{"$f":"'Cost Data'!D952","v":198}]
[null,{"$f":"'Cost Data'!B953","v":"103288 (1)"},null,{"$f":"'Cost Data'!C953","v":"Grounding Ring, Magmeter 12\""},null,null,null,null,null,null,{"$f":"'Cost Data'!D953","v":202}]
[null,{"$f":"'Cost Data'!B954","v":"103922-15"},null,{"$f":"'Cost Data'!C954","v":"15-Pin Connector Kit"},null,null,null,null,null,null,{"$f":"'Cost Data'!D954","v":38}]
[null,{"$f":"'Cost Data'!B955","v":103971},null,{"$f":"'Cost Data'!C955","v":"Battery Replacement Kit, (2) D-Cell"},null,null,null,null,null,null,{"$f":"'Cost Data'!D955","v":126}]
[null,{"$f":"'Cost Data'!B956","v":103500},null,{"$f":"'Cost Data'!C956","v":"Security Seal, Plastic Padlock"},null,null,null,null,null,null,{"$f":"'Cost Data'!D956","v":2}]
[null,{"$f":"'Cost Data'!B957","v":100854},null,{"$f":"'Cost Data'!C957","v":"Wire, for Security Seal, 12\" (For 3\" Only)"},null,null,null,null,null,null,{"$f":"'Cost Data'!D957","v":3}]
[null,{"$f":"'Cost Data'!B958","v":104073},null,{"$f":"'Cost Data'!C958","v":"Security Tab"},null,null,null,null,null,null,{"$f":"'Cost Data'!D958","v":2}]
[null,{"$f":"'Cost Data'!B959","v":"103490-01"},null,{"$f":"'Cost Data'!C959","v":"Display Cover, White"},null,null,null,null,null,null,{"$f":"'Cost Data'!D959","v":14}]
[null,{"$f":"'Cost Data'!B960","v":"103709-01"},null,{"$f":"'Cost Data'!C960","v":"Display Cover Kit, with Lanyard & Split Key Ring"},null,null,null,null,null,null,{"$f":"'Cost Data'!D960","v":36}]
[null,{"$f":"'Cost Data'!B961","v":103984},null,{"$f":"'Cost Data'!C961","v":"Hinged Display Cover Kit"},null,null,null,null,null,null,{"$f":"'Cost Data'!D961","v":36}]
[null,{"$f":"'Cost Data'!B962","v":103166},null,{"$f":"'Cost Data'!C962","v":"Housing Plug, Black, Qty 1 (includes O-Ring)"},null,null,null,null,null,null,{"$f":"'Cost Data'!D962","v":7}]
[null,{"$f":"'Cost Data'!B963","v":"103028-01"},null,{"$f":"'Cost Data'!C963","v":"Cable Strain Relief, Qty 1 (Includes O-Ring)"},null,null,null,null,null,null,{"$f":"'Cost Data'!D963","v":12}]
[null,{"$f":"'Cost Data'!B964","v":"103038-03-245"},null,{"$f":"'Cost Data'!C964","v":"O-Ring, EPDM, Display Housing"},null,null,null,null,null,null,{"$f":"'Cost Data'!D964","v":8}]
[null,{"$f":"'Cost Data'!B965","v":"103105-04-05"},null,{"$f":"'Cost Data'!C965","v":"O-Ring, EPDM 80 Duro"},null,null,null,null,null,null,{"$f":"'Cost Data'!D965","v":2}]
[null,{"$f":"'Cost Data'!B966","v":"103517-02"},null,{"$f":"'Cost Data'!C966","v":"Data Logger Connector (For base models prior 8/2017, DC4 USB required)"},null,null,null,null,null,null,{"$f":"'Cost Data'!D966","v":87}]
[null,{"$f":"'Cost Data'!B967","v":"103951-02"},null,{"$f":"'Cost Data'!C967","v":"Data Logger Connector (For base models after 8/2017, DC4 USB required)"},null,null,null,null,null,null,{"$f":"'Cost Data'!D967","v":87}]
[null,{"$f":"'Cost Data'!B968","v":"103517-01"},null,{"$f":"'Cost Data'!C968","v":"Data Logger Connector (For all \"p\" and \"r\" models, DC4 USB required)"},null,null,null,null,null,null,{"$f":"'Cost Data'!D968","v":87}]
[null,{"$f":"'Cost Data'!B969","v":"DC4-USB"},null,{"$f":"'Cost Data'!C969","v":"Data Logger Download Cable, IP68"},null,null,null,null,null,null,{"$f":"'Cost Data'!D969","v":207}]
[null,{"$f":"'Cost Data'!B970","v":"DC5-USB"},null,{"$f":"'Cost Data'!C970","v":"Data Logger Download Cable, IP68"},null,null,null,null,null,null,{"$f":"'Cost Data'!D970","v":200}]
[null,{"$f":"'Cost Data'!B971","v":102009},null,{"$f":"'Cost Data'!C971","v":"Data Logger Connector Cap"},null,null,null,null,null,null,{"$f":"'Cost Data'!D971","v":23}]
[null,"AG3000 Series Gasket Kits (Includes Two Gaskets)"]
[null,"Model #",null,"Description",null,null,null,null,null,null,"Price"]
[null,{"$f":"'Cost Data'!B973","v":"104035-02"},null,{"$f":"'Cost Data'!C973","v":"Gasket Kit, Flanged Magmeter, 2\""},null,null,null,null,null,null,{"$f":"'Cost Data'!D973","v":16}]
[null,{"$f":"'Cost Data'!B975","v":"104035-04"},null,{"$f":"'Cost Data'!C975","v":"Gasket Kit, Flanged Magmeter, 4\""},null,null,null,null,null,null,{"$f":"'Cost Data'!D975","v":20}]
[null,{"$f":"'Cost Data'!B976","v":"104035-06"},null,{"$f":"'Cost Data'!C976","v":"Gasket Kit, Flanged Magmeter, 6\""},null,null,null,null,null,null,{"$f":"'Cost Data'!D976","v":25}]
[null,{"$f":"'Cost Data'!B977","v":"104035-08"},null,{"$f":"'Cost Data'!C977","v":"Gasket Kit, Flanged Magmeter, 8\""},null,null,null,null,null,null,{"$f":"'Cost Data'!D977","v":30}]
[null,{"$f":"'Cost Data'!B978","v":"104035-10"},null,{"$f":"'Cost Data'!C978","v":"Gasket Kit, Flanged Magmeter, 10\""},null,null,null,null,null,null,{"$f":"'Cost Data'!D978","v":41}]
[null,{"$f":"'Cost Data'!B979","v":"104035-12"},null,{"$f":"'Cost Data'!C979","v":"Gasket Kit, Flanged Magmeter, 12\""},null,null,null,null,null,null,{"$f":"'Cost Data'!D979","v":48}]
[null,"AG3000 Series Grounding Ring & Gasket Kits (Includes Two Gaskets and Two Grounding Rings)"]
[null,"Model #",null,"Description",null,null,null,null,null,null,"Price"]
[null,{"$f":"'Cost Data'!B989","v":"104039-02"},null,{"$f":"'Cost Data'!C989","v":"Grounding Ring/Gasket Kit, Flanged Magmeter, 2\""},null,null,null,null,null,null,{"$f":"'Cost Data'!D989","v":245}]
[null,{"$f":"'Cost Data'!B991","v":"104039-04"},null,{"$f":"'Cost Data'!C991","v":"Grounding Ring/Gasket Kit, Flanged Magmeter, 4\""},null,null,null,null,null,null,{"$f":"'Cost Data'!D991","v":273}]
[null,{"$f":"'Cost Data'!B992","v":"104039-06"},null,{"$f":"'Cost Data'!C992","v":"Grounding Ring/Gasket Kit, Flanged Magmeter, 6\""},null,null,null,null,null,null,{"$f":"'Cost Data'!D992","v":292}]
[null,{"$f":"'Cost Data'!B993","v":"104039-08"},null,{"$f":"'Cost Data'!C993","v":"Grounding Ring/Gasket Kit, Flanged Magmeter, 8\""},null,null,null,null,null,null,{"$f":"'Cost Data'!D993","v":311}]
[null,{"$f":"'Cost Data'!B994","v":"104039-10"},null,{"$f":"'Cost Data'!C994","v":"Grounding Ring/Gasket Kit, Flanged Magmeter, 10\""},null,null,null,null,null,null,{"$f":"'Cost Data'!D994","v":435}]
[null,{"$f":"'Cost Data'!B995","v":"104039-12"},null,{"$f":"'Cost Data'!C995","v":"Grounding Ring/Gasket Kit, Flanged Magmeter, 12\""},null,null,null,null,null,null,{"$f":"'Cost Data'!D995","v":449}]

{"sheet":"AG90","index":16,"n_rows":48,"n_cols":8,"rows_kept":48,"cut":false,"hidden":true,"merged":[[1,0,7,0],[1,5,1,6],[2,5,2,6],[3,3,7,3],[3,5,3,6],[4,5,4,6],[5,5,5,6],[6,5,6,6],[7,5,7,6],[12,5,12,6],[14,1,14,4],[18,1,18,7],[19,1,19,2],[0,5,0,6],[19,3,19,6],[21,1,21,2],[21,3,21,6],[20,1,20,2],[20,3,20,6],[22,1,22,2],[22,3,22,6],[23,1,23,2],[23,3,23,6],[24,1,24,2],[24,3,24,6],[25,1,25,2],[25,3,25,6],[26,1,26,2],[26,3,26,6],[27,1,27,2],[27,3,27,6],[28,1,28,2],[28,3,28,6],[29,1,29,2],[29,3,29,6],[31,1,31,2],[31,3,31,6],[30,1,30,2],[30,3,30,6],[32,1,32,2],[32,3,32,6],[33,1,33,2],[33,3,33,6],[34,1,34,2],[34,3,34,6],[45,3,45,6],[35,1,35,2],[35,3,35,6],[37,1,37,7],[38,1,38,7],[39,1,39,2],[39,3,39,6],[39,8,47,8],[40,1,40,2],[40,3,40,6],[41,1,41,2],[41,3,41,6],[42,1,42,2],[46,1,46,2],[46,3,46,6],[47,1,47,2],[47,3,47,6],[42,3,42,6],[43,1,43,2],[43,3,43,6],[44,1,44,2],[44,3,44,6],[45,1,45,2]]}
[null,"AG90",{"$f":"_xlfn.IFS(C3=\"\",\" \",C3=4,\"0400\",C3=6,\"0600\",C3=8,\"0800\",C3=10,\"1000\",C3=12,\"1200\")","v":" "},"BX","X",{"$f":"IF(F3=\"Yes\", \"01\", \"XX\")","v":"XX"},null,{"$f":"_xlfn.IFS(H3=\"0064\", \"0064\",H3=\"0154\", \"0154\",H3= \"0304\", \"0304\",H3= \"0454\", \"0454\",H3= \"0604\", \"0604\",H3=\"None\",\"0000\")","v":{"$error":"#N/A"}}]
["AG90",null,"Size","Power","Optional output                                         (Comes Standard with one pulse output)","Options",null,"Power/Output Cable (Must Select One)"]
[null,null,null,"BX - Battery","X (Single Cable for DC Power & output)"]
[null,null,"0400 4\"","BX - Battery",null,".-XX None",null,"0064 = 6m (20ft)"]
[null,null,"0600 6\"",null,null,".-01 Data Logger",null,"0154 = 15m (50ft)"]
[null,null,"0800 8\"",null,null,null,null,"0304 = 30m (100ft)"]
[null,null,"1000 10\"",null,null,null,null,"0454 = 45m (150ft)"]
[null,null,"1200 12\"",null,null,null,null,"0604 = 60m (200ft)"]
[]
[]
[]
[]
[]
[]
[null,{"$f":"_xlfn.TEXTJOIN(\"-\",TRUE,B1:H1)","v":{"$error":"#N/A"}}]
[null,null,"Meter ","Power","Optional Output","Data Logger","Output Cable","List Price"]
[null,"Meter",{"$f":"_xlfn.IFS(C3=4,'Cost Data'!D861,C3=6, 'Cost Data'!D862, C3=8,'Cost Data'!D863,C3=10,'Cost Data'!D864,C3=12,'Cost Data'!D865)","v":{"$error":"#N/A"}},0,0,{"$f":"IF(F1=\"01\", 'Cost Data'!D871,0)","v":0},{"$f":"_xlfn.IFS(H1=\"0064\",'Cost Data'!D866,H1=\"0154\",'Cost Data'!D867,H1=\"0304\",'Cost Data'!D1834,H1=\"0454\",'Cost Data'!D869,H1=\"0604\",'Cost Data'!D870,H1=\"0000\",0)","v":{"$error":"#N/A"}},{"$f":"SUM(C17:G17)","v":{"$error":"#N/A"}}]
[]
[null,"AG90 Parts & Accessories"]
[null,"Model #",null,"Description",null,null,null,"Price"]
[null,103971,null,"Battery Replacement Kit, (2) D-Cell",null,null,null,{"$f":"'Cost Data'!D881","v":126}]
[null,104009,null,"Security U-Clip Kit",null,null,null,{"$f":"'Cost Data'!D882","v":36}]
[null,100264,null,"O-Ring, EPDM, Sensor Shaft",null,null,null,{"$f":"'Cost Data'!D883","v":17}]
[null,"103038-03-245",null," O-Ring, EPDM, Display Housing",null,null,null,{"$f":"'Cost Data'!D884","v":8}]
[null,103500,null,"Security Seal, Plastic Padlock",null,null,null,{"$f":"'Cost Data'!D885","v":2}]
[null,104073,null,"Security Tab",null,null,null,{"$f":"'Cost Data'!D886","v":2}]
[null,"103490-01",null,"01 Display Cover, White",null,null,null,{"$f":"'Cost Data'!D887","v":14}]
[null,"103709-01",null,"01 Display Cover Kit, with Lanyard & Split Key Ring",null,null,null,{"$f":"'Cost Data'!D888","v":36}]
[null,103984,null,"Hinged Display Cover Kit",null,null,null,{"$f":"'Cost Data'!D889","v":36}]
[null,"DC4-USB",null,"Data Logger Download Cable, IP68",null,null,null,{"$f":"'Cost Data'!D890","v":207}]
[null,"DC5-USB",null,"Data Logger Download Cable, IP68",null,null,null,{"$f":"'Cost Data'!D891","v":200}]
[null,102009,null,"Data Logger Connector Cap",null,null,null,{"$f":"'Cost Data'!D892","v":23}]
[null,100248,null,"Cap, Blind, PVC, EX/IP/TX800 series",null,null,null,{"$f":"'Cost Data'!D893","v":49}]
[null,100249,null,"Cap, Blind, Polypro, EX/IP/TX800 series",null,null,null,{"$f":"'Cost Data'!D894","v":49}]
[null,100250,null,"Cap, Blind, SS, EX/IP/TX800 series",null,null,null,{"$f":"'Cost Data'!D895","v":97}]
[null,100251,null,"Cap, Blind, Brass, EX/IP/TX800 Series",null,null,null,{"$f":"'Cost Data'!D896","v":72}]
[]
[null,"Note: Saddle is included with EX90 purchase. Items below for after sale purchase."]
[null,"AG90 Saddles & Gaskets"]
[null,"103977-04",null,"4 Inch Saddle (4.00\" - 4.90\" O.D. range) ",null,null,null,{"$f":"'Cost Data'!D872","v":159}]
[null,"103977-06",null,"6 Inch Saddle (6.00\" - 6.90\" O.D. range) ",null,null,null,{"$f":"'Cost Data'!D873","v":185}]
[null,"103977-08",null,"8 Inch Saddle (8.00\" - 9.05\" O.D. range) ",null,null,null,{"$f":"'Cost Data'!D874","v":203}]
[null,"103977-10",null,"10 Inch Saddle (10.40\" - 11.10\" O.D. range) ",null,null,null,{"$f":"'Cost Data'!D875","v":224}]
[null,"103977-12",null,"12 Inch Saddle (12.10\" - 13.20\" O.D. range) ",null,null,null,{"$f":"'Cost Data'!D876","v":239}]
[null,"104084-04",null,"4 Inch Saddle Gasket ",null,null,null,{"$f":"'Cost Data'!D877","v":13}]
[null,"104084-06",null,"6 Inch Saddle Gasket ",null,null,null,{"$f":"'Cost Data'!D878","v":15}]
[null,"104084-08",null,"8 Inch Saddle Gasket ",null,null,null,{"$f":"'Cost Data'!D879","v":18}]
[null,"104084-1012",null,"10 or 12 Inch Saddle Gasket ",null,null,null,{"$f":"'Cost Data'!D880","v":21}]

{"sheet":"Meter Pick Data","index":17,"n_rows":157,"n_cols":20,"rows_kept":157,"cut":false,"hidden":true,"merged":[]}
[]
[]
[]
[]
[]
[]
[]
[]
[]
[]
[]
[]
[]
[]
[]
[]
[]
[]
[]
[]
[]
[]
[]
[]
[]
[]
[]
[]
[]
["iMAG"]
["Cables_Single","Cables_Double","Cables_Remote","No Optional Output","Fourto20mA","4-20mA","HART","Modbus","AC_Modbus","DC_Modbus","Battery","DC","AC","D.C.","A.C.","DC_remote","AC_remote","ModbusConnector","NoOptionalOutputConnector","4-20mAConnector"]
[".-006S",".-006D",".-006",".-006S",".-006S",".-006S",".-006S",".-006D",".-006S",".-006D","No Optional Output Connector","No Optional Output Connector","No Optional Output","No Optional Output","No Optional Output","No Optional Output","No Optional Output",".-0068",".-0064",".-0068"]
[".-015S",".-015D",".-015",".-015S",".-015S",".-015S",".-015S",".-015D",".-015S",".-015D","Modbus Connector","_4_20mA Connector","_4_20mA","HART","HART","_4_20mA","_4_20mA",".-0158",".-0154",".-0158"]
[".-030S",".-030D",".-030",".-030S",".-030S",".-030S",".-030S",".-030D",".-030S",".-030D",null,"Modbus Connector","HART","DC_Modbus","AC_Modbus","HART","HART",".-0308",".-0304",".-0308"]
[".-045S",".-045D",".-045",".-045S",".-045S",".-045S",".-045S",".-045D",".-045S",".-045D",null,null,"Modbus",null,null,"Modbus","AC_Modbus",".-0458",".-0454",".-0458"]
[".-060S",".-060D",".-060",".-060S",".-060S",".-060S",".-060S",".-060D",".-060S",".-060D",null,null,null,null,null,null,null,".-0608",".-0604",".-0608"]
[null,null,0,0,0,0,0,0,0,null,null,null,null,null,null,null,null,0,0,0]
["WMP",null,"Size","Option 1",null,null,"WMP_104","WMP_101","Units Rate","Units Total","Pulse_Rate","WMP101","WMP104"]
[null,null,"1 inch= -100","Tamper-evident seal, screws, and wire  = -32",null,null,"Tamper-evident seal, screws, and wire","Tamper-evident seal, screws, and wire","Gal/Min = GPM","Gal = G","High Frequency = -HF","High Frequency = -HF"]
[null,null,"2 inch= -200","Extended ",null,null,"Extended Battery Life","BSP fittings","Liters/Sec = LPS","Gal x 1000 = GT","1 Units/Pulse = -PxU","1 Units/Pulse = -PxU"]
[null,null,"3 inch= -300",null,null,null,"BSP fittings",{"$f":"IF(WMP!C2<>100,\"No Fitting Kit (Deduct Price)\",\" \")","v":{"$error":"#N/A"}},"Liter/Min = LPM","Cubic Feet = CF"]
[null,null,null,null,null,null,{"$f":"IF(WMP!C2<>100,\"No Fitting Kit (Deduct Price)\",\" \")","v":{"$error":"#N/A"}},null,"Cu Ft/Sec = CFS","Acre Inch = AI"]
[null,null,"WMP101","WMP104",null,null,null,null,"Cu Ft/Min = CFM","Acre Feet = AF",null,"WMP101","WMP104"]
[null,null,null,null,null,null,null,null,"Cu Met/Min = CMM","Liter = L",null,"High Frequency = -HF"]
[null,null,null,null,null,null,null,null,"Cu Met/Hr = CMH","Mega Liters = ML",null,"1 Units/Pulse = -PxU"]
[null,null,null,null,null,null,null,"High frequency output","Mil Gal/Day = MGD","Cubic Meters = CM"]
[null,null,null,null,null,null,null,null,"Mil Lt/Day = MLD","Cu Met x 1000 = CMT"]
["EX90"]
[null,"Power/Output Cable"]
[null,"006S","6 Meter (20 ft.) Power/Output Cable, 6 Con",79]
[null,"015S","15 Meter (50 ft.) Power/Output Cable, 6 Con ",142]
[null,"030S","30 Meter (100 ft.) Power/Output Cable, 6 Con",247]
[null,"045S","45 Meter (150 ft.) Power/Output Cable, 6 Con",352]
[null,"060S","60 Meter (200 ft.) Power/Output Cable, 6 Con",457]
["EX100/200 Series"]
["EX100/200_Size","Options 110","Options 210","Options 150","Options 250",null,"EX110","EX210","EX150","EX250"]
["3” – 10” pipe = EX110","Brass Adapter Fitting 2” NPT = -02","Brass Adapter Fitting 2” NPT = -02","316 SS Valve Assembly = -08","316 SS Valve Assembly = -08",null,"Brass Adapter Fitting 2” NPT = -02","Brass Adapter Fitting 2” NPT = -02","316 SS Valve Assembly = -08","316 SS Valve Assembly = -08"]
["10” – 48” pipe = EX210","SS Adapter Fitting 2” NPT = -02","SS Adapter Fitting 2” NPT = -02","No Valve Assembly = -09","No Valve Assembly = -09",null,"SS Adapter Fitting 2” NPT = -02","SS Adapter Fitting 2” NPT = -02","No Valve Assembly = -09","No Valve Assembly = -09"]
["Hot Tap 3” – 10” pipe = EX150 ","Reverse Flow Output = -15","Reverse Flow Output = -15","Reverse Flow Output = -15","Reverse Flow Output = -15",null,"Reverse Flow Output = -15","Reverse Flow Output = -15","Reverse Flow Output = -15","Reverse Flow Output = -15"]
["Hot Tap 10” – 48” pipe = EX250","Brass Adapter 1 ½” BSP = -23","Brass Adapter 1 ½” BSP = -23","*Immersible = -40","*Immersible = -40",null,"Brass Adapter 1 ½” BSP = -23","Brass Adapter 1 ½” BSP = -23","*Immersible = -40","*Immersible = -40"]
[null,"SS Adapter 1 ½” BSP = -24","SS Adapter 1 ½” BSP = -24","12” Extension (200 Series Only) = -72","12” Extension (200 Series Only) = -72",null,"SS Adapter 1 ½” BSP = -24","SS Adapter 1 ½” BSP = -24","12” Extension (200 Series Only) = -72","12” Extension (200 Series Only) = -72"]
[null,"Old Style Adapter 1 ½” NPT = -35","Old Style Adapter 1 ½” NPT = -35",null,null,null,"Old Style Adapter 1 ½” NPT = -35","Old Style Adapter 1 ½” NPT = -35"]
[null,"*Immersible = -40","*Immersible = -40",null,null,null,"*Immersible = -40","*Immersible = -40"]
[null,"Low Power = -50","Low Power = -50",null,null,null,"Low Power = -50","Low Power = -50"]
[null,"12” Extension (200 Series Only) = -72","12” Extension (200 Series Only) = -72",null,null,null,"12” Extension (200 Series Only) = -72","12” Extension (200 Series Only) = -72"]
[]
[null,"Options 113","Options 213","Options 153","Options 253",null,"EX113","EX213","EX153","EX253"]
[null,"Brass Adapter Fitting 2” NPT = -02","Brass Adapter Fitting 2” NPT = -02","316 SS Valve Assembly = -08","316 SS Valve Assembly = -08",null,"Brass Adapter Fitting 2” NPT = -02","Brass Adapter Fitting 2” NPT = -02","316 SS Valve Assembly = -08","316 SS Valve Assembly = -08"]
[null,"SS Adapter Fitting 2” NPT = -02","SS Adapter Fitting 2” NPT = -02","No Valve Assembly = -09","No Valve Assembly = -09",null,"SS Adapter Fitting 2” NPT = -02","SS Adapter Fitting 2” NPT = -02","No Valve Assembly = -09","No Valve Assembly = -09"]
[null,"Reverse Flow Output = -15","Reverse Flow Output = -15","Reverse Flow Output = -15","Reverse Flow Output = -15",null,"Reverse Flow Output = -15","Reverse Flow Output = -15","Reverse Flow Output = -15","Reverse Flow Output = -15"]
[null,"Brass Adapter 1 ½” BSP = -23","Brass Adapter 1 ½” BSP = -23","Tamper Evident Kit = -32","Tamper Evident Kit = -32",null,"Brass Adapter 1 ½” BSP = -23","Brass Adapter 1 ½” BSP = -23","Tamper Evident Kit = -32","Tamper Evident Kit = -32"]
[null,"SS Adapter 1 ½” BSP = -24","SS Adapter 1 ½” BSP = -24","Low Power = -50","Low Power = -50",null,"SS Adapter 1 ½” BSP = -24","SS Adapter 1 ½” BSP = -24","Low Power = -50","Low Power = -50"]
[null,"Tamper Evident Kit = -32","Tamper Evident Kit = -32","12” Extension (200 Series Only) = -72","12” Extension (200 Series Only) = -72",null,"Tamper Evident Kit = -32","Tamper Evident Kit = -32","12” Extension (200 Series Only) = -72","12” Extension (200 Series Only) = -72"]
[null,"Old Style Adapter 1 ½” NPT = -35","Old Style Adapter 1 ½” NPT = -35","Non-resettable Total = 64","Non-resettable Total = 64",null,"Old Style Adapter 1 ½” NPT = -35","Old Style Adapter 1 ½” NPT = -35","Non-resettable Total = 64","Non-resettable Total = 64"]
[null,"Low Power = -50","Low Power = -50","Dual Relay Output = 98","Dual Relay Output = 98",null,"Low Power = -50","Low Power = -50","Dual Relay Output = 98","Dual Relay Output = 98"]
[null,"Non-resettable Total = 64","Non-resettable Total = 64","Hinged Display Cover = -126","Hinged Display Cover = -126",null,"Non-resettable Total = 64","Non-resettable Total = 64","Hinged Display Cover = -126","Hinged Display Cover = -126"]
[null,"12” Extension (200 Series Only) = -72","12” Extension (200 Series Only) = -72",null,null,null,"12” Extension (200 Series Only) = -72","12” Extension (200 Series Only) = -72"]
[null,"Hinged Display Cover = -126","Hinged Display Cover = -126",null,null,null,"Hinged Display Cover = -126","Hinged Display Cover = -126"]
[]
[null,"Options 116","Options 216","Options 156","Options 256",null,"EX116","EX216","EX156","EX256"]
[null,"Brass Adapter Fitting 2” NPT = -02","Brass Adapter Fitting 2” NPT = -02","316 SS Valve Assembly = -08","316 SS Valve Assembly = -08",null,"Brass Adapter Fitting 2” NPT = -02","Brass Adapter Fitting 2” NPT = -02","316 SS Valve Assembly = -08","316 SS Valve Assembly = -08"]
[null,"SS Adapter Fitting 2” NPT = -02","SS Adapter Fitting 2” NPT = -02","No Valve Assembly = -09","No Valve Assembly = -09",null,"SS Adapter Fitting 2” NPT = -02","SS Adapter Fitting 2” NPT = -02","No Valve Assembly = -09","No Valve Assembly = -09"]
[null,"Reverse Flow Output = -15","Reverse Flow Output = -15","Reverse Flow Output = -15","Reverse Flow Output = -15",null,"Reverse Flow Output = -15","Reverse Flow Output = -15","Reverse Flow Output = -15","Reverse Flow Output = -15"]
[null,"Brass Adapter 1 ½” BSP = -23","Brass Adapter 1 ½” BSP = -23","Tamper Evident Kit = -32","Tamper Evident Kit = -32",null,"Brass Adapter 1 ½” BSP = -23","Brass Adapter 1 ½” BSP = -23","Tamper Evident Kit = -32","Tamper Evident Kit = -32"]
[null,"SS Adapter 1 ½” BSP = -24","SS Adapter 1 ½” BSP = -24","Low Power = -50","Low Power = -50",null,"SS Adapter 1 ½” BSP = -24","SS Adapter 1 ½” BSP = -24","Low Power = -50","Low Power = -50"]
[null,"Tamper Evident Kit = -32","Tamper Evident Kit = -32","12” Extension (200 Series Only) = -72","12” Extension (200 Series Only) = -72",null,"Tamper Evident Kit = -32","Tamper Evident Kit = -32","12” Extension (200 Series Only) = -72","12” Extension (200 Series Only) = -72"]
[null,"Old Style Adapter 1 ½” NPT = -35","Old Style Adapter 1 ½” NPT = -35",null,null,null,"Old Style Adapter 1 ½” NPT = -35","Old Style Adapter 1 ½” NPT = -35"]
[null,"Low Power = -50","Low Power = -50",null,null,null,"Low Power = -50","Low Power = -50"]
[null,"12” Extension (200 Series Only) = -72","12” Extension (200 Series Only) = -72",null,null,null,"12” Extension (200 Series Only) = -72","12” Extension (200 Series Only) = -72"]
[]
[null,"Options 119","Options 219","Options 159","Options 259",null,"EX119","EX219","EX159","EX259"]
[null,"Brass Adapter Fitting 2” NPT = -02","Brass Adapter Fitting 2” NPT = -02","316 SS Valve Assembly = -08","316 SS Valve Assembly = -08",null,"Brass Adapter Fitting 2” NPT = -02","Brass Adapter Fitting 2” NPT = -02","316 SS Valve Assembly = -08","316 SS Valve Assembly = -08"]
[null,"SS Adapter Fitting 2” NPT = -02","SS Adapter Fitting 2” NPT = -02","No Valve Assembly = -09","No Valve Assembly = -09",null,"SS Adapter Fitting 2” NPT = -02","SS Adapter Fitting 2” NPT = -02","No Valve Assembly = -09","No Valve Assembly = -09"]
[null,"Reverse Flow Output = -15","Reverse Flow Output = -15","Reverse Flow Output = -15","Reverse Flow Output = -15",null,"Reverse Flow Output = -15","Reverse Flow Output = -15","Reverse Flow Output = -15","Reverse Flow Output = -15"]
[null,"Brass Adapter 1 ½” BSP = -23","Brass Adapter 1 ½” BSP = -23","Tamper Evident Kit = -32","Tamper Evident Kit = -32",null,"Brass Adapter 1 ½” BSP = -23","Brass Adapter 1 ½” BSP = -23","Tamper Evident Kit = -32","Tamper Evident Kit = -32"]
[null,"SS Adapter 1 ½” BSP = -24","SS Adapter 1 ½” BSP = -24","Low Power = -50","Low Power = -50",null,"SS Adapter 1 ½” BSP = -24","SS Adapter 1 ½” BSP = -24","Low Power = -50","Low Power = -50"]
[null,"Tamper Evident Kit = -32","Tamper Evident Kit = -32","12” Extension (200 Series Only) = -72","12” Extension (200 Series Only) = -72",null,"Tamper Evident Kit = -32","Tamper Evident Kit = -32","12” Extension (200 Series Only) = -72","12” Extension (200 Series Only) = -72"]
[null,"Old Style Adapter 1 ½” NPT = -35","Old Style Adapter 1 ½” NPT = -35","Non-resettable Total = 64","Non-resettable Total = 64",null,"Old Style Adapter 1 ½” NPT = -35","Old Style Adapter 1 ½” NPT = -35","Non-resettable Total = 64","Non-resettable Total = 64"]
[null,"Low Power = -50","Low Power = -50","Dual Relay Output = 98","Dual Relay Output = 98",null,"Low Power = -50","Low Power = -50","Dual Relay Output = 98","Dual Relay Output = 98"]
[null,"Non-resettable Total = 64","Non-resettable Total = 64","Hinged Display Cover = -126","Hinged Display Cover = -126",null,"Non-resettable Total = 64","Non-resettable Total = 64","Hinged Display Cover = -126","Hinged Display Cover = -126"]
[null,"12” Extension (200 Series Only) = -72","12” Extension (200 Series Only) = -72",null,null,null,"12” Extension (200 Series Only) = -72","12” Extension (200 Series Only) = -72"]
[null,"Hinged Display Cover = -126","Hinged Display Cover = -126",null,null,null,"Hinged Display Cover = -126","Hinged Display Cover = -126"]
[]
[]
[null,"Sensor_only","FT430_","DL76_","FT440_"]
[null,"EX110","EX113","EX116","EX119"]
[null,"EX210","EX213","EX216","EX219"]
[null,"EX150","EX153","EX156","EX159"]
[null,"EX250","EX253","EX256","EX259"]
["IP100/200 Series"]
[null,".Sensor_only",".FT430_",".DL76_",".FT450_",".FT440_"]
[null,"IP110","IP113","IP116","IP117","IP119"]
[null,"IP210","IP213","IP216","IP217","IP219"]
[null,"IP150","IP153","IP156","IP157","IP159"]
[null,"IP250","IP253","IP256","IP257","IP259"]
[]
[null,"Sensor_IP","FT430_IP","DL76_IP","FT450_IP","FT440_IP"]
[null,"IP110","IP113","IP116","IP117","IP119"]
[null,"IP210","IP213","IP216","IP217","IP219"]
[null,"IP150","IP153","IP156","IP157","IP159"]
[null,"IP250","IP253","IP256","IP257","IP259"]
["EX800","Only_Sensor","FT_430","DL_76","FT_440"]
[null,"EX810","EX813","EX816","EX819"]
[null,"EX820","EX823","EX826","EX829"]
[null,"EX830","EX833","EX836","EX839"]
["IP800","Sensor_IPs","FT430_IPs","DL76_IPs","FT450_IPs","FT440_IPs"]
[null,"IP810","IP813","IP816","IP817","IP819"]
[null,"IP820","IP823","IP826","IP827","IP829"]
["S-Series","SPX","SPT","SES"]
[null,"038","038","050"]
[null,"050","050","075"]
[null,"075","075","100"]
[null,"100","100"]
[]
[null,"SPX Options","SPT Options","SES"]
[]
[]
[null,"-70 SAE Ports","-70 SAE Ports"]
[null,"-116 BSP Threads","-117 BSP Threads"]
[null,70,70]
[null,116,117]
[]
[]
[]
[]
[]
[]
["In-line Turbine","WTP","WTS","Electronics"]
[null,300,300,100]
[null,400,400,103]
[null,600,600,107]
[null,null,800,109]
[]
[null,null,null,"FT Series","Style"]
[null,null,null,"FT430","W"]
[null,null,null,"FT440",{"$f":"IF('FT 400 Series'!C12<>\"FT450\",\"P\",\"\")","v":"P"}]
[null,null,null,"FT450"]

{"sheet":"Cost Data","index":18,"n_rows":1033,"n_cols":11,"rows_kept":1033,"cut":false,"hidden":true,"merged":[[1014,0,1014,3]]}
["Style","Item","Description","MY 2021"]
["iMAG Base","IMAG4700-0200","Flanged In-Line MagMeter w/ Integral Display, Base Model",1765]
["iMAG Base","IMAG4700-0300","Flanged In-Line MagMeter w/ Integral Display, Base Model",1861]
["iMAG Base","IMAG4700-0400","Flanged In-Line MagMeter w/ Integral Display, Base Model",1995]
["iMAG Base","IMAG4700-0600","Flanged In-Line MagMeter w/ Integral Display, Base Model",2139]
["iMAG Base","IMAG4700-0800","Flanged In-Line MagMeter w/ Integral Display, Base Model",2465]
["iMAG Base","IMAG4700-1000","Flanged In-Line MagMeter w/ Integral Display, Base Model",2909]
["iMAG Base","IMAG4700-1200","Flanged In-Line MagMeter w/ Integral Display, Base Model",3491]
["iMAG Base","P","Gasket Kit, Flanged Magmeter, NSF, 2\"",35]
["iMAG Base","P","Gasket Kit, Flanged Magmeter, NSF, 3\"",47]
["iMAG Base","P","Gasket Kit, Flanged Magmeter, NSF, 4\"",65]
["iMAG Base","P","Gasket Kit, Flanged Magmeter, NSF, 6\"",92]
["iMAG Base","P","Gasket Kit, Flanged Magmeter, NSF, 8\"",135]
["iMAG Base","P","Gasket Kit, Flanged Magmeter, NSF, 10\"",180]
["iMAG Base","P","Gasket Kit, Flanged Magmeter, NSF, 12\"",270]
["iMAG Base","L","4-20mA",169]
["iMAG Base","H","Hart 4-20mA",268]
["iMAG Base","S","Modbus",360]
["iMAG Base","01","Data Logger",85]
["iMAG Base","0068","6 Meter (20 ft.) Power/Output Cable, 8 Pin",133]
["iMAG Base","0158","15 Meter (50 ft.) Power/Output Cable, 8 Pin",206]
["iMAG Base","0308","30 Meter (100 ft.) Power/Output Cable, 8 Pin",338]
["iMAG Base","0458","45 Meter (150 ft.) Power/Output Cable, 8 Pin",482]
["iMAG Base","0608","60 Meter (200 ft.) Power/Output Cable, 8 Pin",625]
["iMAG Base","0064","6 Meter (20 ft.) Power/Output Cable, 4 Pin",107]
["iMAG Base","0154","15 Meter (50 ft.) Power/Output Cable, 4 Pin",171]
["iMAG Base","0304","30 Meter (100 ft.) Power/Output Cable, 4 Pin",284]
["iMAG Base","0454","45 Meter (150 ft.) Power/Output Cable, 4 Pin",404]
["iMAG Base","0604","60 Meter (200 ft.) Power/Output Cable, 4 Pin",525]
["iMAG Premium","IMAG4700p-0200","Flanged In-Line MagMeter w/ Integral Display, Premium Model",2332]
["iMAG Premium","IMAG4700p-0300","Flanged In-Line MagMeter w/ Integral Display, Premium Model",2455]
["iMAG Premium","IMAG4700p-0400","Flanged In-Line MagMeter w/ Integral Display, Premium Model",2601]
["iMAG Premium","IMAG4700p-0600","Flanged In-Line MagMeter w/ Integral Display, Premium Model",2755]
["iMAG Premium","IMAG4700p-0800","Flanged In-Line MagMeter w/ Integral Display, Premium Model",2956]
["iMAG Premium","IMAG4700p-1000","Flanged In-Line MagMeter w/ Integral Display, Premium Model",3405]
["iMAG Premium","IMAG4700p-1200","Flanged In-Line MagMeter w/ Integral Display, Premium Model",4331]
["iMAG Premium","104036-02","Gasket Kit, Flanged Magmeter, NSF, 2\"",35]
["iMAG Premium","104036-03","Gasket Kit, Flanged Magmeter, NSF, 3\"",47]
["iMAG Premium","104036-04","Gasket Kit, Flanged Magmeter, NSF, 4\"",65]
["iMAG Premium","104036-06","Gasket Kit, Flanged Magmeter, NSF, 6\"",92]
["iMAG Premium","104036-08","Gasket Kit, Flanged Magmeter, NSF, 8\"",135]
["iMAG Premium","104036-10","Gasket Kit, Flanged Magmeter, NSF, 10\"",180]
["iMAG Premium","104036-12","Gasket Kit, Flanged Magmeter, NSF, 12\"",270]
["iMAG Premium","A1","AC Power (1.8 Meter (6ft.) AC power cord included)",135]
["iMAG Premium","H","Hart 4-20mA",281]
["iMAG Premium","S","Modbus",360]
["iMAG Premium","01","Data Logger",85]
["iMAG Premium","006D","DC Power/Output Cable, 6 Meter (20 ft.), 8 Con",214]
["iMAG Premium","015D","DC Power/Output Cable, 15 Meter (50 ft.), 8 Con",382]
["iMAG Premium","030D","DC Power/Output Cable, 30 Meter (100 ft.), 8 Con",664]
["iMAG Premium","045D","DC Power/Output Cable, 45 Meter (150 ft.), 8 Con",945]
["iMAG Premium","060D","DC Power/Output Cable, 60 Meter (200 ft.), 8 Con",1226]
["iMAG Premium","006S","DC Power/Output Cable, 6 Meter (20 ft.), 8 Con",107]
["iMAG Premium","015S","DC Power/Output Cable, 15 Meter (50 ft.), 8 Con",192]
["iMAG Premium","030S","DC Power/Output Cable, 30 Meter (100 ft.), 8 Con",332]
["iMAG Premium","045S","DC Power/Output Cable, 45 Meter (150 ft.), 8 Con",473]
["iMAG Premium","060S","DC Power/Output Cable, 60 Meter (200 ft.), 8 Con",612]
["iMAG Remote","IMAG4700r-0200","Flanged In-Line MagMeter w/ Remote Display",3087]
["iMAG Remote","IMAG4700r-0300","Flanged In-Line MagMeter w/ Remote Display",3201]
["iMAG Remote","IMAG4700r-0400","Flanged In-Line MagMeter w/ Remote Display",3320]
["iMAG Remote","IMAG4700r-0600","Flanged In-Line MagMeter w/ Remote Display",3443]
["iMAG Remote","IMAG4700r-0800","Flanged In-Line MagMeter w/ Remote Display",3676]
["iMAG Remote","IMAG4700r-1000","Flanged In-Line MagMeter w/ Remote Display",4102]
["iMAG Remote","IMAG4700r-1200","Flanged In-Line MagMeter w/ Remote Display",5426]
["iMAG Remote","P","Gasket Kit, Flanged Magmeter, NSF, 2\"",35]
["iMAG Remote","P","Gasket Kit, Flanged Magmeter, NSF, 3\"",47]
["iMAG Remote","P","Gasket Kit, Flanged Magmeter, NSF, 4\"",65]
["iMAG Remote","P","Gasket Kit, Flanged Magmeter, NSF, 6\"",92]
["iMAG Remote","P","Gasket Kit, Flanged Magmeter, NSF, 8\"",135]
["iMAG Remote","P","Gasket Kit, Flanged Magmeter, NSF, 10\"",180]
["iMAG Remote","P","Gasket Kit, Flanged Magmeter, NSF, 12\"",270]
["iMAG Remote","A1","AC Power (1.8 Meter (6ft.) AC power cord included)",135]
["iMAG Remote","L","4-20mA",169]
["iMAG Remote","H","Hart 4-20mA",281]
["iMAG Remote","S","Modbus",360]
["iMAG Remote","01","Data Logger",85]
["iMAG Remote","006D","6 Meter (20 ft.) Power/Output Cable, 6 Con (Qty 2)",169]
["iMAG Remote","015D","15 Meter (50 ft.) Power/Output Cable, 6 Con (Qty 2)",305]
["iMAG Remote","030D","30 Meter (100 ft.) Power/Output Cable, 6 Con (Qty 2)",529]
["iMAG Remote","045D","45 Meter (150 ft.) Power/Output Cable, 6 Con (Qty 2)",754]
["iMAG Remote","060D","60 Meter (200 ft.) Power/Output Cable, 6 Con (Qty 2)",979]
["iMAG Remote","006S","6 Meter (20 ft.) Power/Output Cable, 6 Con",85]
["iMAG Remote","015S","15 Meter (50 ft.) Power/Output Cable, 6 Con ",152]
["iMAG Remote","030S","30 Meter (100 ft.) Power/Output Cable, 6 Con",265]
["iMAG Remote","045S","45 Meter (150 ft.) Power/Output Cable, 6 Con",377]
["iMAG Remote","060S","60 Meter (200 ft.) Power/Output Cable, 6 Con",489]
["iMAG Remote","006","6 Meter (20 ft.) Sensor Cable",85]
["iMAG Remote","015","15 Meter (50 ft.) Sensor Cable",152]
["iMAG Remote","030","30 Meter (100 ft.) Sensor Cable",265]
["iMAG Remote","045","45 Meter (150 ft.) Sensor Cable",377]
["iMAG Remote","060","60 Meter (200 ft.) Sensor Cable",489]
["iMAG All","103410-02","Grounding Ring Kit, 2 Inch Magmeters",214]
["iMAG All","103410-03","Grounding Ring Kit, 3 Inch Magmeters",237]
["iMAG All","103410-04","Grounding Ring Kit, 4 Inch Magmeters",253]
["iMAG All","103410-06","Grounding Ring Kit, 6 Inch Magmeters",267]
["iMAG All","103410-08","Grounding Ring Kit, 8 Inch Magmeters",279]
["iMAG All","103410-10","Grounding Ring Kit, 10 Inch Magmeters",394]
["iMAG All","103410-12","Grounding Ring Kit, 12 Inch Magmeters",402]
["WMP","WMP101-100","Plastic Bodied In-Line Magmeter, DC Powered, 1\" ",1055]
["WMP","WMP101-200","Plastic Bodied In-Line Magmeter, DC Powered, 2\"",1180]
["WMP","WMP101-300","Plastic Bodied In-Line Magmeter, DC Powered, 3\"",1467]
["WMP","WMP104-100","Plastic Bodied In-Line Magmeter, Battery Powered, 1\"",943]
["WMP","WMP104-200","Plastic Bodied In-Line Magmeter, Battery Powered, 2\"",1082]
["WMP","WMP104-300","Plastic Bodied In-Line Magmeter, Battery Powered, 3\"",1323]
["WMP",32,"Tamper-Evident Kit, Wire, Seal",35]
["WMP",93,"BSP Fitting Kit (Male Thread, Replaces NPT Kit) 2\"& 3\" Only",0]
["WMP",96,"No Fitting Kit 2\" (Deduct Price)",-51]
["WMP",96,"No Fitting Kit 3\" (Deduct Price)",-87]
["WMP",133,"Extended Battery Life (WMP104 only)",92]
["WMP",101222,"Kit, 2\" WMP FNPT Flange Clamps",142]
["WMP",102203,"Kit, 2\", WMP BSP Flange Clamps (Male Thread)",142]
["WMP",102073,"Kit, 3\" WMP FNPT Flange Clamps",210]
["WMP",102204,"Kit, 3\", WMP BSP Flange Clamps (Male Thread)",210]
["FT430W","FT430W","DC Powered, Scaled Pulse & Pulse Passthrough Output, Wall Mount",446]
["FT440W","FT440W","Loop Powered, Dual Scaled Pulse Output & 4-20 mA Output, Wall Mount",578]
["DL76W","DL76W","Data Logger, Wall Mount",487]
["EX90","EX90-0400","4 Inch",1452]
["EX90","EX90-0600","6 Inch",1510]
["EX90","EX90-0800","8 Inch",1568]
["EX90","EX90-1000","10 Inch",1654]
["EX90","EX90-1200","12 Inch",1725]
["EX90","0064","6 Meter (20 ft.) Power/Output Cable, 4 Pin",107]
["EX90","0154","15 Meter (50 ft.) Power/Output Cable, 4 Pin",171]
["EX90","0304","30 Meter (100 ft.) Power/Output Cable, 4 Pin",284]
["EX90","0454","45 Meter (150 ft.) Power/Output Cable, 4 Pin",404]
["EX90","0604","60 Meter (200 ft.) Power/Output Cable, 4 Pin",525]
["EX90","01","Data Logger",85]
["EX90","103977-04","4 Inch Saddle (4.00\" - 4.90\" O.D. range) ",159]
["EX90","103977-06","6 Inch Saddle (6.00\" - 6.90\" O.D. range) ",185]
["EX90","103977-08","8 Inch Saddle (8.00\" - 9.05\" O.D. range) ",203]
["EX90","103977-10","10 Inch Saddle (10.40\" - 11.10\" O.D. range) ",224]
["EX90","103977-12","12 Inch Saddle (12.10\" - 13.20\" O.D. range) ",239]
["EX90","104084-04","4 Inch Saddle Gasket ",13]
["EX90","104084-06","6 Inch Saddle Gasket ",15]
["EX90","104084-08","8 Inch Saddle Gasket ",18]
["EX90","104084-1012","10 or 12 Inch Saddle Gasket ",21]
["EX90",103971,"Battery Replacement Kit, (2) D-Cell",126]
["EX90",104000,"Standard U-Clip","xxx","Is this gone now?"]
["EX90",104009,"Security U-Clip Kit",36]
["EX90",100264,"O-Ring, EPDM, Sensor Shaft",17]
["EX90","103038-03-245"," O-Ring, EPDM, Display Housing",8]
["EX90",103500,"Security Seal, Plastic Padlock",2]
["EX90",104073,"Security Tab",2]
["EX90","103490-01","01 Display Cover, White",14]
["EX90","103709-01","01 Display Cover Kit, with Lanyard & Split Key Ring",36]
["EX90",103984,"Hinged Display Cover Kit",36]
["EX90","DC4-USB","Data Logger Download Cable, IP68 (Before 5/6/2020)",207]
["EX90","DC5-USB","Data Logger Download Cable, IP68 (After 5/6/2020)",200,"Make sure to add"]
["EX90",102009,"Data Logger Connector Cap",23]
["EX90",100248,"Cap, Blind, PVC, EX/IP/TX800 series",49]
["EX90",100249,"Cap, Blind, Polypro, EX/IP/TX800 series",49]
["EX90",100250,"Cap, Blind, SS, EX/IP/TX800 series",97]
["EX90",100251,"Cap, Blind, Brass, EX/IP/TX800 Series",72]
["EX100-200","EX110B","Adj Depth Insertion Magmeter, Brass, 3\"-10\" ",1339]
["EX100-200","EX110S","Adj Depth Insertion Magmeter, 316 SS, 3\"-10\"",1365]
["EX100-200","EX210B","Adj Depth Insertion Magmeter, Brass, 10\"-48\"",1457]
["EX100-200","EX210S","Adj Depth Insertion Magmeter, 316 SS, 10\"-48\"",1487]
["EX100-200","EX150B","Hot Tap Adj Depth Insertion Magmeter, Brass, 3-10\" ",1716]
["EX100-200","EX150S","Hot Tap Adj Depth Insertion Magmeter, 316 SS, 3\"-10\"",1750]
["EX100-200","EX250B","Hot Tap Adj Depth Insertion Magmeter, Brass, 10\"-48\"",1821]
["EX100-200","EX250S","Hot Tap Adj Depth Insertion Magmeter, 316 SS, 10\"-48\"",1859]
["EX100-200","EX113B ","Adj Depth Insertion Magmeter, Brass, 3\"-10\", FT430",1769]
["EX100-200","EX113S ","Adj Depth Insertion Magmeter, 316 SS, 3'-10\", FT430 ",1796]
["EX100-200","EX213B ","Adj Depth Insertion Magmeter, Brass, 10\"-48\", FT430",1889]
["EX100-200","EX213S ","Adj Depth Insertion Magmeter, 316 SS, 10\"-48\", FT430 ",1917]
["EX100-200","EX153B","Hot Tap Adj Depth Insertion Magmeter, Brass, 3-10\", FT430 ",2164]
["EX100-200","EX153S","Hot Tap Adj Depth Insertion Magmeter, 316 SS, 3\"-10\", FT430 ",2199]
["EX100-200","EX253B","Hot Tap Adj Depth Insertion Magmeter, Brass, 10\"-48\", FT430 ",2251]
["EX100-200","EX253S","Hot Tap Adj Depth Insertion Magmeter, 316 SS, 10\"-48\", FT430 ",2289]
["EX100-200","EX116B ","Adj Depth Insertion Magmeter, Brass, 3\"-10\", DL76 ",1794]
["EX100-200","EX116S ","Adj Depth Insertion Magmeter, 316 SS, 3'-10\", DL76 ",1821]
["EX100-200","EX216B ","Adj Depth Insertion Magmeter, Brass, 10\"-48\", DL76 ",1914]
["EX100-200","EX216S ","Adj Depth Insertion Magmeter, 316 SS, 10\"-48\", DL76  ",1943]
["EX100-200","EX156B","Hot Tap Adj Depth Insertion Magmeter, Brass, 3-10\", DL76   ",2190]
["EX100-200","EX156S","Hot Tap Adj Depth Insertion Magmeter, 316 SS, 3\"-10\", DL76   ",2224]
["EX100-200","EX256B","Hot Tap Adj Depth Insertion Magmeter, Brass, 10\"-48\", DL76   ",2276]
["EX100-200","EX256S","Hot Tap Adj Depth Insertion Magmeter, 316 SS, 10\"-48\", DL76   ",2314]
["EX100-200","EX119B ","Adj Depth Insertion Magmeter, Brass, 3\"-10\", FT440",1838]
["EX100-200","EX119S ","Adj Depth Insertion Magmeter, 316 SS, 3'-10\", FT440 ",1864]
["EX100-200","EX219B ","Adj Depth Insertion Magmeter, Brass, 10\"-48\", FT440",1957]
["EX100-200","EX219S ","Adj Depth Insertion Magmeter, 316 SS, 10\"-48\", FT440 ",1986]
["EX100-200","EX159B","Hot Tap Adj Depth Insertion Magmeter, Brass, 3-10\", FT440 ",2235]
["EX100-200","EX159S","Hot Tap Adj Depth Insertion Magmeter, 316 SS, 3\"-10\", FT440 ",2269]
["EX100-200","EX259B","Hot Tap Adj Depth Insertion Magmeter, Brass, 10\"-48\", FT440 ",2319]
["EX100-200","EX259S","Hot Tap Adj Depth Insertion Magmeter, 316 SS, 10\"-48\", FT440 ",2357]
["EX100-200","02","Brass Adapter Fitting 2 inch NPT = -02",58]
["EX100-200","02","SS Adapter Fitting 2 inch NPT = -02",77]
["EX100-200","08","316 SS Valve Assembly = -08",705]
["EX100-200","09","No Valve Assembly = -09",-90]
["EX100-200",15,"Reverse Flow Output = -15",175]
["EX100-200",23,"Brass Adapter 1.5 inch BSP = -23",370,"What happened to these?"]
["EX100-200",24,"SS Adapter 1.5 inch BSP = -24",510,"What happened to these?"]
["EX100-200",32,"Tamper Evident Kit = -32",35]
["EX100-200",35,"Old Style Adapter 1.5 inch NPT = -35",119,"What happened to these?"]
["EX100-200",40,"*Immersible = -40",107]
["EX100-200",50,"Low Power = -50",0]
["EX100-200",64,"Non-resettable Total = 64",32]
["EX100-200",72,"12 inch Extension = -72",357]
["EX100-200",98,"Dual Relay Output = 98",69]
["EX100-200",126,"Hinged Display Cover = -126",63]
[null,"EX110/210 Series Saddle Fittings"]
["EX110/210","MF101F-300-150","Saddle, Iron, NPT Thread, 3\" X 1-1/2\" (3.45 - 4.05 O.D. range)",378]
["EX110/210","MF101F-400-150","Saddle, Iron, NPT Thread, 4\" X 1-1/2\" (4.00 - 4.50 O.D. range)",231]
["EX110/210","MF101F-600-150","Saddle, Iron, NPT Thread, 6\" X 1-1/2\" (6.00 - 6.63 O.D. range)",238]
["EX110/210","MF101F-800-150","Saddle, Iron, NPT Thread, 8\" X 1-1/2\" (8.00 - 8.63 O.D. range)",285]
["EX110/210","MF101F-1000-150","Saddle, Iron, NPT Thread, 10\" X 1-1/2\" (10.00 - 11.10 O.D. range) ",397]
["EX110/210","MF101F-1200-150","Saddle, Iron, NPT Thread, 12\" X 1-1/2\" (12.00 - 13.20 O.D. range) ",491]
["EX110/210","MF101F-1400-150","Saddle, Iron, NPT Thread, 14\" X 1-1/2\" (15.30 - 16.80 O.D. range) ",702]
["EX110/210","MF101F-1600-150","Saddle, Iron, NPT Thread, 16\" X 1-1/2\"(17.40 - 18.90 O.D. range) ",756]
["EX110/210","MF101F-1800-150","Saddle, Iron, NPT Thread, 18\" X 1-1/2\"(19.50 - 21.10 O.D. range) ",992]
["EX110/210","MF101F-2000-150","Saddle, Iron, NPT Thread, 20\" X 1-1/2\"(21.10 - 22.70 O.D. range) ",1235]
["EX110/210","MF101F-2200-150","Saddle, Iron, NPT Thread, 22\" X 1-1/2\"(22.70 - 24.30 O.D. range) ",1243]
["EX110/210","MF101F-2400-150","Saddle, Iron, NPT Thread, 24\" X 1-1/2\"(24.30 - 25.90 O.D. range) ",1361]
["EX110/210","MF101B-400-150","Saddle, Brass, NPT Thread 4\" X 1-1/2\"",450]
[null,"EX150/250 Series Saddle Fittings"]
["EX150/250","MF101F-300-200","Saddle, Iron, NPT Thread, 3\" X 2\" (3.45 - 4.05 O.D. range)",378]
["EX150/250","MF101F-400-200","Saddle, Iron, NPT Thread, 4\" X 2\" (4.00 - 4.50 O.D. range)",231]
["EX150/250","MF101F-600-200","Saddle, Iron, NPT Thread, 6\" X 2\" (6.00 - 6.63 O.D. range)",238]
["EX150/250","MF101F-800-200","Saddle, Iron, NPT Thread, 8\" X 2\" (8.00 - 8.63 O.D. range)",285]
["EX150/250","MF101F-1000-200","Saddle, Iron, NPT Thread, 10\" X 2\" (10.00 - 11.10 O.D. range)",397]
["EX150/250","MF101F-1200-200","Saddle, Iron, NPT Thread, 12\" X 2\" (12.00 - 13.20 O.D. range)",491]
["EX150/250","MF101F-1400-200","Saddle, Iron, NPT Thread, 14\" X 2\" (15.30 - 16.80 O.D. range)",702]
["EX150/250","MF101F-1600-200","Saddle, Iron, NPT Thread, 16\" X 2\"(17.40 - 18.90 O.D. range)",756]
["EX150/250","MF101F-1800-200","Saddle, Iron, NPT Thread, 18\" X 2\"(19.50 - 21.10 O.D. range)",992]
["EX150/250","MF101F-2000-200","Saddle, Iron, NPT Thread, 20\" X 2\"(21.10 - 22.70 O.D. range)",1188]
["EX150/250","MF101F-2200-200","Saddle, Iron, NPT Thread, 22\" X 2\"(22.70 - 24.30 O.D. range)",1243]
["EX150/250","MF101F-2400-200","Saddle, Iron, NPT Thread, 24\" X 2\"(24.30 - 25.90 O.D. range)",1361]
["EX150/250","MF101B-300-200","Saddle, Brass, NPT Thread, 3\" X 2\" ",455]
["EX150/250","MF101B-400-200","Saddle, Brass, NPT Thread, 4\" X 2\" ",520]
[null,"EX110/210 Series Parts & Accessories"]
["EX110/210",101850,"Strain Relief Kit Large, 1/2\", NPT ",21]
["EX110/210",100411,"Gasket, Upper Housing ",16]
["EX110/210",102021,"Hinged Display Cover Kit",64]
["EX110/210",100662,"Housing Assy, Upper, Blind (Gasket, Screws, Washers, Label) ",63]
["EX110/210",103702,"White Housing Screw/Washer Kit",4]
["EX110/210",100414,"Screw/Washer Kit, Upper Housing (Qty 4)",3]
["EX110/210",100853,"Security Seal, w/12\" of Wire ",5]
["EX110/210",100854,"Wire, for Security Seal, 12\" (For 3\" Only)",3]
[null,"EX150/250 Series Parts & Accessories"]
["EX150/250",101850,"Strain Relief Kit Large, 1/2\", NPT",21]
["EX150/250",100411,"Gasket, Upper Housing ",16]
["EX150/250",102021,"Hinged Display Cover Kit",64]
["EX150/250",100662,"Housing Assy, Upper, Blind (Gasket, Screws, Washers, Label)",63]
["EX150/250",103702,"White Housing Screw/Washer Kit",4]
["EX150/250",100345,"O-Ring, EPDM, Black",17]
["EX150/250",100414,"Screw/Washer Kit, Upper Housing (Qty 4) ",3]
["EX150/250",100853,"Security Seal, w/12\" of Wire ",5]
["EX150/250",100069,"Valve Assembly, Brass, Hot-Tap ",299]
["EX150/250",100119,"Valve Assembly, 316 SS, Hot-Tap",718]
["EX150/250",100854,"Wire, for Security Seal, 12\" (For 3\" Only)",3]
["EX150/250",100066,"Nipple, Close, Thd, Brass, 2\" ",81]
["EX150/250",100103,"Nipple, Close, 316 SS, 2\"",97]
["IP100-200","IP110B","Adj Depth Insertion Paddlewheel Meter, Brass, 3\"-12\"",758]
["IP100-200","IP110P","Adj Depth Insertion Paddlewheel Meter, PVC, 3\"-12\"",668]
["IP100-200","IP110S","Adj Depth Insertion Paddlewheel Meter, 316 SS, 3\"-12\"",774]
["IP100-200","IP210B","Adj Depth Insertion Paddlewheel Meter, Brass, 12\"- 40\"",797]
["IP100-200","IP210P","Adj Depth Insertion Paddlewheel Meter, PVC, 12\"- 40\"",721]
["IP100-200","IP210S","Adj Depth Insertion Paddlewheel Meter, 316 SS, 12\"- 40\"",814]
["IP100-200","IP150B","Hot Tap Adj Depth Insertion Paddlewheel Meter, Brass, 3\"-12\"",1105]
["IP100-200","IP150P","Hot Tap Adj Depth Insertion Paddlewheel Meter, PVC, 3\"-12\"",1019]
["IP100-200","IP150S","Hot Tap Adj Depth Insertion Paddlewheel Meter, 316 SS, 3\"-12\"",1128]
["IP100-200","IP250B","Hot Tap Adj Depth Insertion Paddlewheel Meter, Brass, 12\"- 40\"",1137]
["IP100-200","IP250P","Hot Tap Adj Depth Insertion Paddlewheel Meter, PVC, 12\"- 40\"",1072]
["IP100-200","IP250S","Hot Tap Adj Depth Insertion Paddlewheel Meter, 316 SS, 12\"- 40\"",1160]
["IP100-200","IP113B","Adj Depth Insertion Paddlewheel Meter, Brass, 3\"-12\" FT430",1217]
["IP100-200","IP113P","Adj Depth Insertion Paddlewheel Meter, PVC, 3\"-12\" FT430",1153]
["IP100-200","IP113S","Adj Depth Insertion Paddlewheel Meter, 316 SS, 3\"-12\" FT430",1230]
["IP100-200","IP213B","Adj Depth Insertion Paddlewheel Meter, Brass, 12\"- 40\" FT430",1255]
["IP100-200","IP213P","Adj Depth Insertion Paddlewheel Meter, PVC, 12\"- 40\" FT430",1184]
["IP100-200","IP213S","Adj Depth Insertion Paddlewheel Meter, 316 SS, 12\"- 40\" FT430",1271]
["IP100-200","IP153B","Hot Tap Adj Depth Insertion Paddlewheel Meter, Brass, 3\"-12\" FT430",1565]
["IP100-200","IP153P","Hot Tap Adj Depth Insertion Paddlewheel Meter, PVC, 3\"-12\" FT430",1483]
["IP100-200","IP153S","Hot Tap Adj Depth Insertion Paddlewheel Meter, 316 SS, 3\"-12\" FT430",1584]
["IP100-200","IP253B","Hot Tap Adj Depth Insertion Paddlewheel Meter, Brass, 12\"- 40\" FT430",1595]
["IP100-200","IP253P","Hot Tap Adj Depth Insertion Paddlewheel Meter, PVC, 12\"- 40\" FT430",1536]
["IP100-200","IP253S","Hot Tap Adj Depth Insertion Paddlewheel Meter, 316 SS, 12\"- 40\" FT430",1617]
["IP100-200","IP116B","Adj Depth Insertion Paddlewheel Meter, Brass, 3\"-12\", DL76",1243]
["IP100-200","IP116P","Adj Depth Insertion Paddlewheel Meter, PVC, 3\"-12\", DL76",1181]
["IP100-200","IP116S","Adj Depth Insertion Paddlewheel Meter, 316 SS, 3\"-12\", DL76",1256]
["IP100-200","IP216B","Adj Depth Insertion Paddlewheel Meter, Brass, 12\"- 40\", DL76",1282]
["IP100-200","IP216P","Adj Depth Insertion Paddlewheel Meter, PVC, 12\"- 40\", DL76",1212]
["IP100-200","IP216S","Adj Depth Insertion Paddlewheel Meter, 316 SS, 12\"- 40\", DL76",1297]
["IP100-200","IP156B","Hot Tap Adj Depth Insertion Paddlewheel Meter, Brass, 3\"-12\", DL76",1592]
["IP100-200","IP156P","Hot Tap Adj Depth Insertion Paddlewheel Meter, PVC, 3\"-12\", DL76",1510]
["IP100-200","IP156S","Hot Tap Adj Depth Insertion Paddlewheel Meter, 316 SS, 3\"-12\", DL76",1611]
["IP100-200","IP256B","Hot Tap Adj Depth Insertion Paddlewheel Meter, Brass, 12\"- 40\", DL76",1621]
["IP100-200","IP256P","Hot Tap Adj Depth Insertion Paddlewheel Meter, PVC, 12\"- 40\", DL76",1562]
["IP100-200","IP256S","Hot Tap Adj Depth Insertion Paddlewheel Meter, 316 SS, 12\"- 40\", DL76",1644]
["IP100-200","IP117B","Adj Depth Insertion Paddlewheel Meter, Brass, 3\"-12\", FT450",1334]
["IP100-200","IP117P","Adj Depth Insertion Paddlewheel Meter, PVC, 3\"-12\", FT450",1278]
["IP100-200","IP117S","Adj Depth Insertion Paddlewheel Meter, 316 SS, 3\"-12\", FT450",1346]
["IP100-200","IP217B","Adj Depth Insertion Paddlewheel Meter, Brass, 12\"- 40\", FT450",1373]
["IP100-200","IP217P","Adj Depth Insertion Paddlewheel Meter, PVC, 12\"- 40\", FT450",1303]
["IP100-200","IP217S","Adj Depth Insertion Paddlewheel Meter, 316 SS, 12\"- 40\", FT450",1387]
["IP100-200","IP157B","Hot Tap Adj Depth Insertion Paddlewheel Meter, Brass, 3\"-12\", FT450",1681]
["IP100-200","IP157P","Hot Tap Adj Depth Insertion Paddlewheel Meter, PVC, 3\"-12\", FT450",1601]
["IP100-200","IP157S","Hot Tap Adj Depth Insertion Paddlewheel Meter, 316 SS, 3\"-12\", FT450",1701]
["IP100-200","IP257B","Hot Tap Adj Depth Insertion Paddlewheel Meter, Brass, 12\"- 40\", FT450",1713]
["IP100-200","IP257P","Hot Tap Adj Depth Insertion Paddlewheel Meter, PVC, 12\"- 40\", FT450",1654]
["IP100-200","IP257S","Hot Tap Adj Depth Insertion Paddlewheel Meter, 316 SS, 12\"- 40\", FT450",1734]
["IP100-200","IP119B","Adj Depth Insertion Paddlewheel Meter, Brass, 3\"-12\", FT440",1289]
["IP100-200","IP119P","Adj Depth Insertion Paddlewheel Meter, PVC, 3\"-12\", FT440",1231]
["IP100-200","IP119S","Adj Depth Insertion Paddlewheel Meter, 316 SS, 3\"-12\", FT440",1302]
["IP100-200","IP219B","Adj Depth Insertion Paddlewheel Meter, Brass, 12\"- 40\", FT440",1328]
["IP100-200","IP219P","Adj Depth Insertion Paddlewheel Meter, PVC, 12\"- 40\", FT440",1258]
["IP100-200","IP219S","Adj Depth Insertion Paddlewheel Meter, 316 SS, 12\"- 40\", FT440",1342]
["IP100-200","IP159B","Hot Tap Adj Depth Insertion Paddlewheel Meter, Brass, 3\"-12\", FT440",1637]
["IP100-200","IP159P","Hot Tap Adj Depth Insertion Paddlewheel Meter, PVC, 3\"-12\", FT440",1556]
["IP100-200","IP159S","Hot Tap Adj Depth Insertion Paddlewheel Meter, 316 SS, 3\"-12\", FT440",1656]
["IP100-200","IP259B","Hot Tap Adj Depth Insertion Paddlewheel Meter, Brass, 12\"- 40\", FT440",1667]
["IP100-200","IP259P","Hot Tap Adj Depth Insertion Paddlewheel Meter, PVC, 12\"- 40\", FT440",1609]
["IP100-200","IP259S","Hot Tap Adj Depth Insertion Paddlewheel Meter, 316 SS, 12\"- 40\", FT440",1691]
["IP100-200","01","Rotor w/ Ceramic Shaft, PVDF, Kynar®",82]
["IP100-200","02","New Style Adapter Fitting, 2\" NPT Threads, Brass",58]
["IP100-200","02","New Style Adapter Fitting, 2\" NPT Threads, SS",77]
["IP100-200","04","Micropower Pickup -Required for use with FT450 = -04",0]
["IP100-200","06","Standard Power, LMI 4-pin Connector = -06",37]
["IP100-200","07","Stnd Power, Seametrics Ctrl Connector = -07",37]
["IP100-200","08","316 SS Valve Assy (SS Meters Only) ",705]
["IP100-200","09","No Valve Assembly (Deduct price)",-90]
["IP100-200",23,"Old Style (2 piece) Adapter, (1-1/2\" BSP Thread Tapered), Brass",370,"What happened to these?"]
["IP100-200",24,"Old Style (2 piece) Adapter, (1-1/2\" BSP Thread Tapered), SS",510,"What happened to these?"]
["IP100-200",32,"Tamper-Evident Kit, Wire, Seal",35]
["IP100-200",35,"Old Style (2 piece) Adapter, (1-1/2\" NPT Thread)",119]
["IP100-200",40,"*Immersible",107]
["IP100-200",64,"Non-Resettable Total",32]
["IP100-200",68,"Silicon Carbide Shaft",130]
["IP100-200",72,"12\" Extension (210/250 Series Only, Brass & SS Only)",357]
["IP100-200",98,"Dual Relay Output",69]
["IP100-200",106,"Roytronic® Series-A 5-Pin Connector = -106",37]
["IP100-200",126,"Hinged Display Cover Kit",63]
["EX800","EX810B","Fixed Depth Insertion Magmeter, Brass, 1\"-3\" ",852]
["EX800","EX810P","Fixed Depth Insertion Magmeter, PVC, 1\"-3\" ",767]
["EX800","EX810S","Fixed Depth Insertion Magmeter, 316 SS, 1\"-3\" ",869]
["EX800","EX820B","Fixed Depth Insertion Magmeter, Brass, 4\"-10\" ",895]
["EX800","EX820P","Fixed Depth Insertion Magmeter, PVC, 4\"-10\" ",789]
["EX800","EX820S","Fixed Depth Insertion Magmeter, 316 SS, 4\"-10\" ",912]
["EX800","EX830B","Fixed Depth Insertion Magmeter, Brass, 12\" ",962]
["EX800","EX830P","Fixed Depth Insertion Magmeter, PVC, 12\" ",851]
["EX800","EX830S","Fixed Depth Insertion Magmeter, 316 SS, 12\" ",981]
["EX800","EX813B","Fixed Depth Insertion Magmeter, Brass, 1\"-3\", FT430 ",1300]
["EX800","EX813P","Fixed Depth Insertion Magmeter, PVC, 1\"-3\", FT430 ",1210]
["EX800","EX813S","Fixed Depth Insertion Magmeter, 316 SS, 1\"-3\", FT430 ",1318]
["EX800","EX823B","Fixed Depth Insertion Magmeter, Brass, 4\"-10\", FT430 ",1325]
["EX800","EX823P","Fixed Depth Insertion Magmeter, PVC, 4\"-10\", FT430 ",1233]
["EX800","EX823S","Fixed Depth Insertion Magmeter, 316 SS, 4\"-10\", FT430 ",1343]
["EX800","EX833B","Fixed Depth Insertion Magmeter, Brass, 12\", FT430 ",1392]
["EX800","EX833P","Fixed Depth Insertion Magmeter, PVC, 12\", FT430 ",1294]
["EX800","EX833S","Fixed Depth Insertion Magmeter, 316 SS, 12\", FT430 ",1411]
["EX800","EX816B","Fixed Depth Insertion Magmeter, Brass, 1\"-3\", DL76 ",1326]
["EX800","EX816P","Fixed Depth Insertion Magmeter, PVC, 1\"-3\", DL76 ",1237]
["EX800","EX816S","Fixed Depth Insertion Magmeter, 316 SS, 1\"-3\", DL76 ",1344]
["EX800","EX826B","Fixed Depth Insertion Magmeter, Brass, 4\"-10\", DL76 ",1350]
["EX800","EX826P","Fixed Depth Insertion Magmeter, PVC, 4\"-10\", DL76 ",1258]
["EX800","EX826S","Fixed Depth Insertion Magmeter, 316 SS, 4\"-10\", DL76 ",1368]
["EX800","EX836B","Fixed Depth Insertion Magmeter, Brass, 12\", DL76 ",1418]
["EX800","EX836P","Fixed Depth Insertion Magmeter, PVC, 12\", DL76 ",1319]
["EX800","EX836S","Fixed Depth Insertion Magmeter, 316 SS, 12\", DL76 ",1436]
["EX800","EX819B","Fixed Depth Insertion Magmeter, Brass, 1\"-3\", FT440 ",1371]
["EX800","EX819P","Fixed Depth Insertion Magmeter, PVC,1\"-3\", FT440 ",1281]
["EX800","EX819S","Fixed Depth Insertion Magmeter, 316 SS, 1\"-3\", FT440 ",1388]
["EX800","EX829B","Fixed Depth Insertion Magmeter, Brass, 4\"-10\", FT440 ",1393]
["EX800","EX829P","Fixed Depth Insertion Magmeter, PVC, 4\"-10\", FT440 ",1302]
["EX800","EX829S","Fixed Depth Insertion Magmeter, 316 SS, 4\"-10\", FT440 ",1411]
["EX800","EX839B","Fixed Depth Insertion Magmeter, Brass, 12\", FT440 ",1461]
["EX800","EX839P","Fixed Depth Insertion Magmeter, PVC, 12\", FT440 ",1364]
["EX800","EX839S","Fixed Depth Insertion Magmeter, 316 SS, 12\", FT440 ",1479]
["EX800",15,"Reverse Flow Output = -15",175]
["EX800",32,"Tamper Evident Kit = -32",35]
["EX800",40,"*Immersible = -40",107]
["EX800",50,"Low Power = -50",0]
["EX800",64,"Non-resettable Total = 64",32]
["EX800",98,"Dual Relay Output = 98",69]
["EX800",125,"Viton O-Ring = -125",19]
["EX800",126,"Hinged Display Cover = -126",63]
[null,"EX800 Series Tee Fittings"]
["EX800","EF81T-B-100","Tee Fitting, Bronze, Threaded, 1\", EX ",305]
["EX800","EF81T-B-150","Tee Fitting, Bronze, Threaded, 1-1/2\", EX ",324]
["EX800","EF81T-B-200","Tee Fitting, Bronze, Threaded, 2\", EX ",349]
["EX800","EF81T-B-300","Tee Fitting, Bronze, Threaded, 3\", EX ",432]
["EX800","EF81T-B-400","Tee Fitting, Bronze, Threaded, 4\", EX ",768]
["EX800","EF81TC-B-100","Tee Fitting, Bronze, Sweat, 1\", EX ",335]
["EX800","EF81TC-B-150","Tee Fitting, Bronze, Sweat, 1-1/2\", EX ",353]
["EX800","EF81TC-B-200","Tee Fitting, Bronze, Sweat, 2\", EX ",380]
["EX800","EF81TC-B-300","Tee Fitting, Bronze, Sweat, 3\", EX ",453]
["EX800","EF81TC-B-400","Tee Fitting, Bronze, Sweat, 4\", EX ",769]
["EX800","EF81T-P-100 ","Tee Fitting, PVC, 1\", EX, Block Tee ",161]
["EX800","EF81T-P-150 ","Tee Fitting, PVC, 1-1/2\", EX, Pipe Stub ",146]
["EX800","EF81T-P-200","Tee Fitting, PVC, 2\", EX, Pipe Stub ",153]
["EX800","EF81T-P-200-18 ","Tee Fitting, PVC, Flanged Ends, 2\",EX ",279]
["EX800","EF81T-C-100 ","Tee Fitting, Carbon Steel, 1\", EX",424]
["EX800","EF81T-C-150 ","Tee Fitting, Carbon Steel, 1-1/2\", EX",500]
["EX800","EF81T-C-200","Tee Fitting, Carbon Steel, 2\", EX",527]
["EX800","EF81T-C-200-34 ","Tee Fitting, Carbon Steel, Flanged Ends, 2\", EX",849]
["EX800","EF81T-S-100","Tee Fitting, 304 SS, 1\", EX ",603]
["EX800","EF81T-S-150","Tee Fitting, 304 SS, 1-1/2\", EX ",616]
["EX800","EF81T-S-200","Tee Fitting, 304 SS, 2\", EX ",637]
["EX800","EF81T-S-100-14","Tee Fitting, 316 SS, 1\", EX ",874]
["EX800","EF81T-S-150-14","Tee Fitting, 316 SS, 1-1/2\", EX ",903]
["EX800","EF81T-S-200-14","Tee Fitting, 316 SS, 2\", EX ",948]
["EX800","EF81T-S-200-20","Tee Fitting, 304 SS, Flanged Ends, 2\", EX ",1046]
["EX800","EF81T-S-200-14-20","Tee Fitting, 316 SS, Flanged Ends, 2\", EX ",1368]
[null,"EX800 Series Saddle Fittings"]
["EX800","EF82S-F-300","Saddle, Iron, 3\", EX (3.45 - 4.05 O.D. range)",426]
["EX800","EF82S-F-400","Saddle, Iron, 4\", EX (4.00 - 4.50 O.D. range)",344]
["EX800","EF82S-F-600","Saddle, Iron, 6\", EX (6.00 - 6.63 O.D. range)",399]
["EX800","EF82S-F-800","Saddle, Iron, 8\", EX (8.00 - 8.63 O.D. range)",427]
["EX800","EF82S-F-1000","Saddle, Iron, 10\", EX (10.00 - 11.10 O.D. range)",512]
["EX800","EF82S-F-1200","Saddle, Iron, 12\", EX (12.00 - 13.20 O.D. range)",602]
["EX800","EF82S-P-300","Saddle, PVC, 3\", EX",172]
["EX800","EF82S-P-400","Saddle, PVC, 4\", EX",201]
["EX800","EF82S-P-600","Saddle, PVC, 6\", EX",236]
["EX800","EF82S-P-800","Saddle, PVC, 8\", EX",269]
["EX800","EF82S-P-300-16","Saddle, PVC, 3\",w/ 16\" Length Pipe Stub, EX",224]
["EX800","EF82S-P-400-16","Saddle, PVC, 4\",w/ 16\" Length Pipe Stub, EX",253]
["EX800","EF82S-P-600-16","Saddle, PVC, 6\",w/ 16\" Length Pipe Stub, EX",292]
["EX800","EF82S-P-800-16","Saddle, PVC, 8\",w/ 16\" Length Pipe Stub, EX",337]
["EX800","EF82S-B-300","Saddle, Bronze, 3\", EX",632]
["EX800","EF82S-B-400","Saddle, Bronze, 4\", EX",667]
[null,"EX800 Series Weld/Braze Fittings"]
["EX800","EF82W-B-300","Weldolet, Brass, 3\", EX",190]
["EX800","EF82W-B-400","Weldolet, Brass, 4\", EX",190]
["EX800","EF82W-B-600","Weldolet, Brass, 6\", EX",190]
["EX800","EF82W-B-800","Weldolet, Brass, 8\", EX",190]
["EX800","EF82W-B-1000","Weldolet, Brass, 10\", EX",190]
["EX800","EF82W-B-1200","Weldolet, Brass, 12\", EX",190]
["EX800","EF82W-C-300","Weldolet, Carbon Steel, 3\", EX",191]
["EX800","EF82W-C-400","Weldolet, Carbon Steel, 4\", EX",191]
["EX800","EF82W-C-600","Weldolet, Carbon Steel, 6\", EX",191]
["EX800","EF82W-C-800","Weldolet, Carbon Steel, 8\", EX",191]
["EX800","EF82W-C-1000","Weldolet, Carbon Steel, 10\", EX",191]
["EX800","EF82W-C-1200","Weldolet, Carbon Steel, 12\", EX",191]
["EX800","EF82W-S-300","Weldolet, 316 SS, 3\", EX",259]
["EX800","EF82W-S-400","Weldolet, 316 SS, 4\", EX",259]
["EX800","EF82W-S-600","Weldolet, 316 SS, 6\", EX",259]
["EX800","EF82W-S-800","Weldolet, 316 SS, 8\", EX",259]
["EX800","EF82W-S-1000","Weldolet, 316 SS, 10\", EX",259]
["EX800","EF82W-S-1200","Weldolet, 316 SS, 12\", EX",259]
[null,"EX800 Series Weld/Braze Fittings"]
["EX800",100248,"Cap, Blind, PVC, EX/IP/TX800 series",49]
["EX800",100249,"Cap, Blind, Polypro, EX/IP/TX800 series",49]
["EX800",100250,"Cap, Blind, SS, EX/IP/TX800 series",97]
["EX800",100251,"Cap, Blind, Brass, EX/IP/TX800 Series",72]
["EX800",101850,"Strain Relief Kit Large, 1/2\", NPT",21]
["EX800",100411,"Gasket, Upper Housing",16]
["EX800",102021,"Hinged Display Cover Kit",64]
["EX800",100662,"Housing Assy, Upper, Blind (Gasket, Screws, Washers, Label)",63]
["EX800",103702,"White Housing Screw/Washer Kit",4]
["EX800",100264,"O-Ring, EPDM, Sensor Shaft",17]
["EX800",100219,"O-Ring, Viton®, Brown",21]
["EX800",100414,"Screw/Washer Kit, Upper Housing (Qty 4)",3]
["EX800",100853,"Security Seal, w/12\" of Wire",5]
["EX800",100854,"Wire, for Security Seal, 12\" (For 3\" Only)",3]
["EX800",104000,"Standard U-Clip",15]
["EX800",100763,"Standard Retaining Pin (2 Required)",22]
["EX800",103319,"Security Screw Kit, 10-24 x 0.625\",",15]
["IP800","IP810B","Fixed Depth Insertion Paddlewheel Meter, Brass, 1/2\"-3\"",499]
["IP800","IP810P","Fixed Depth Insertion Paddlewheel Meter, PVC, 1/2\"-3\"",361]
["IP800","IP810S","Fixed Depth Insertion Paddlewheel Meter, 316 SS, 1/2\"-3\"",509]
["IP800","IP810Y","Fixed Depth Insertion Paddlewheel Meter, Polypro, 1/2\"-3\"",434]
["IP800","IP810S-HP","Fixed Depth Insertion Paddlewheel Meter, 316 SS, Hi Pres, 1/2\"-3\"",731]
["IP800","IP820B","Fixed Depth Insertion Paddlewheel Meter, Brass, 4\"-8\"",550]
["IP800","IP820P","Fixed Depth Insertion Paddlewheel Meter, PVC, 4\"-8\"",384]
["IP800","IP820S","Fixed Depth Insertion Paddlewheel Meter, 316 SS, 4\"-8\"",562]
["IP800","IP820Y","Fixed Depth Insertion Paddlewheel Meter, Polypro, 4\"-8\"",460]
["IP800","IP820S-HP","Fixed Depth Insertion Paddlewheel Meter, 316 SS, Hi Pres, 4\"-8\"",755]
["IP800","IP813B","Fixed Depth Insertion Paddlewheel Meter, Brass, 1/2\"-3\", FT430",940]
["IP800","IP813P","Fixed Depth Insertion Paddlewheel Meter, PVC, 1/2\"-3\", FT430",797]
["IP800","IP813S","Fixed Depth Insertion Paddlewheel Meter, 316 SS, 1/2\"-3\", FT430",948]
["IP800","IP813Y","Fixed Depth Insertion Paddlewheel Meter, Polypro, 1/2\"-3\", FT430",834]
["IP800","IP813S-HP","Fixed Depth Insertion Paddlewheel Meter, 316 SS, Hi Pres,1/2\"-3\",FT430",1170]
["IP800","IP823B","Fixed Depth Insertion Paddlewheel Meter, Brass, 4\"-8\", FT430",991]
["IP800","IP823P","Fixed Depth Insertion Paddlewheel Meter, PVC, 4\"-8\", FT430",819]
["IP800","IP823S","Fixed Depth Insertion Paddlewheel Meter, 316 SS, 4\"-8\", FT430",1001]
["IP800","IP823Y","Fixed Depth Insertion Paddlewheel Meter, Polypro, 4\"-8\", FT430",857]
["IP800","IP823S-HP","Fixed Depth Insertion Paddlewheel Meter, 316 SS, Hi Pres, 4\"-8\",FT430",1194]
["IP800","IP816B","Fixed Depth Insertion Paddlewheel Meter, Brass, 1/2\"-3\", DL76",965]
["IP800","IP816P","Fixed Depth Insertion Paddlewheel Meter, PVC, 1/2\"-3\", DL76",822]
["IP800","IP816S","Fixed Depth Insertion Paddlewheel Meter, 316 SS, 1/2\"-3\", DL76",973]
["IP800","IP816Y","Fixed Depth Insertion Paddlewheel Meter, Polypro, 1/2\"-3\", DL76",859]
["IP800","IP816S-HP","Fixed Depth Insertion Paddlewheel Meter, 316 SS, Hi Pres, 1/2\"-3\",DL76",1195]
["IP800","IP826B","Fixed Depth Insertion Paddlewheel Meter, Brass, 4\"-8\", DL76",1016]
["IP800","IP826P","Fixed Depth Insertion Paddlewheel Meter, PVC, 4\"-8\", DL76",844]
["IP800","IP826S","Fixed Depth Insertion Paddlewheel Meter, 316 SS, 4\"-8\", DL76",1026]
["IP800","IP826Y","Fixed Depth Insertion Paddlewheel Meter, Polypro, 4\"-8\", DL76",882]
["IP800","IP826S-HP","Fixed Depth Insertion Paddlewheel Meter, 316 SS, Hi Pres, 4\"-8\",DL76",1220]
["IP800","IP817B","Fixed Depth Insertion Paddlewheel Meter, Brass, 1/2\"-3\", FT450",1052]
["IP800","IP817P","Fixed Depth Insertion Paddlewheel Meter, PVC, 1/2\"-3\", FT450",908]
["IP800","IP817S","Fixed Depth Insertion Paddlewheel Meter, 316 SS, 1/2\"-3\", FT450",1061]
["IP800","IP817Y","Fixed Depth Insertion Paddlewheel Meter, Polypro,1-1/2'-3\", FT450",946]
["IP800","IP817S-HP","Fixed Depth Insertion Paddlewheel Meter, 316 SS, Hi Pres,1/2\"-3\",FT450",1282]
["IP800","IP827B","Fixed Depth Insertion Paddlewheel Meter, Brass, 4\"-8\", FT450",1104]
["IP800","IP827P","Fixed Depth Insertion Paddlewheel Meter, PVC, 4\"-8\", FT450",930]
["IP800","IP827S","Fixed Depth Insertion Paddlewheel Meter, 316 SS, 4\"-8\", FT450",1113]
["IP800","IP827Y","Fixed Depth Insertion Paddlewheel Meter, Polypro, 4\"-8\", FT450",969]
["IP800","IP827S-HP","Fixed Depth Insertion Paddlewheel Meter, 316 SS, Hi Pres, 4\"-8\",FT450",1306]
["IP800","IP819B","Fixed Depth Insertion Paddlewheel Meter, Brass, 1/2\"-3\", FT440",1009]
["IP800","IP819P","Fixed Depth Insertion Paddlewheel Meter, PVC, 1/2\"-3\", FT440",865]
["IP800","IP819S","Fixed Depth Insertion Paddlewheel Meter, 316 SS, 1/2\"-3\", FT440",1017]
["IP800","IP819Y","Fixed Depth Insertion Paddlewheel Meter, Polypro, 1/2\"-3\", FT440",903]
["IP800","IP819S-HP","Fixed Depth Insertion Paddlewheel Meter, 316 SS, Hi Pres,1/2\"-3\",FT440",1239]
["IP800","IP829B","Fixed Depth Insertion Paddlewheel Meter, Brass, 4\"-8\", FT440",1061]
["IP800","IP829P","Fixed Depth Insertion Paddlewheel Meter, PVC, 4\"-8\", FT440",887]
["IP800","IP829S","Fixed Depth Insertion Paddlewheel Meter, 316 SS, 4\"-8\", FT440",1070]
["IP800","IP829Y","Fixed Depth Insertion Paddlewheel Meter, Polypro, 4\"-8\", FT440",926]
["IP800","IP829S-HP","Fixed Depth Insertion Paddlewheel Meter, 316 SS, Hi Pres, 4\"-8\",FT440",1264]
["IP800","01","Rotor w/ Ceramic Shaft, PVDF, Kynar = -01",82]
["IP800","04","Micropower Pickup = -04",0]
["IP800","06","Standard Power, LMI 4-pin Connector = -06",37]
["IP800","07","Stnd Power, Seametrics Ctrl Connector = -07",37]
["IP800","32","Tamper Evident Kit = -32",35]
["IP800",40,"*Immersible = -40",107]
["IP800",60,"Viton O-Ring, Brown = -60",19]
["IP800",64,"Non-resettable Total = 64",32]
["IP800",68,"Rotor with Kynar/Silicon Carbide Shaft = -68",130]
["IP800",98,"Dual Relay Output = 98",69]
["IP800",106,"Roytronic® Series-A 5-Pin Connector = -106",37]
["IP800",126,"Hinged Display Cover = -126",63]
["IP800","HP","**High Pressure (Stainless Only) = -HP",0]
[null,"IP800 Series Tee Fittings"]
["IP800","MF81TC-B-050","Tee Fitting, Bronze, Sweat, 1/2\", IP",280]
["IP800","MF81TC-B-075","Tee Fitting, Bronze, Sweat, 3/4\", IP",292]
["IP800","MF81TC-B-100","Tee Fitting, Bronze, Sweat, 1\", IP",319]
["IP800","MF81TC-B-150","Tee Fitting, Bronze, Sweat, 1-1/2\", IP",354]
["IP800","MF81TC-B-200","Tee Fitting, Bronze, Sweat, 2\", IP",369]
["IP800","MF81TC-B-300","Tee Fitting, Bronze, Sweat, 3\", IP",453]
["IP800","MF81TC-B-400","Tee Fitting, Bronze, Sweat, 4, IP",768]
["IP800","MF81T-B-050","Tee Fitting, Bronze, 1/2\", Threaded, IP",273]
["IP800","MF81T-B-075","Tee Fitting, Bronze, 3/4\", Threaded, IP",285]
["IP800","MF81T-B-100","Tee Fitting, Bronze, 1\", Threaded, IP",308]
["IP800","MF81T-B-150","Tee Fitting, Bronze, 1-1/2\", Threaded, IP",323]
["IP800","MF81T-B-200","Tee Fitting, Bronze, 2\", Threaded, IP",349]
["IP800","MF81T-B-300","Tee Fitting, Bronze, 3\", Threaded, IP",432]
["IP800","MF81T-B-400","Tee Fitting, Bronze, 4\", Threaded, IP",769]
["IP800","MF81T-P-050","Tee Fitting, PVC, 1/2\", IP, Block Tee",144]
["IP800","MF81T-P-075","Tee Fitting, PVC, 3/4\", IP, Block Tee",154]
["IP800","MF81T-P-100","Tee Fitting, PVC, 1\", IP, Block Tee",161]
["IP800","MF81T-P-150","Tee Fitting, PVC, 1-1/2\", IP, Pipe Stub",146]
["IP800","MF81T-P-200","Tee Fitting, PVC, 2\", IP, Pipe Stub",153]
["IP800","MF81T-P-200-18","Tee Fitting, PVC, Flanged Ends, 2\", IP",279]
["IP800","MF81T-C-050","Tee Fitting, Carbon Steel, 1/2\", IP",355]
["IP800","MF81T-C-075","Tee Fitting, Carbon Steel, 3/4\", IP",384]
["IP800","MF81T-C-100","Tee Fitting, Carbon Steel, 1\", IP",424]
["IP800","MF81T-C-150","Tee Fitting, Carbon Steel, 1-1/2\", IP",520]
["IP800","MF81T-C-200","Tee Fitting, Carbon Steel, 2\", IP",596]
["IP800","MF81T-C-200-34","Tee Fitting, Carbon Steel, Flanged Ends, 2\", IP",1004]
["IP800","MF81T-C-050-HP","Tee Fitting, Carbon Steel, Hi Pres, 1/2\", IP",559]
["IP800","MF81T-C-075-HP","Tee Fitting, Carbon Steel, Hi Pres, 3/4\", IP",476]
["IP800","MF81T-C-100-HP","Tee Fitting, Carbon Steel, Hi Pres, 1\", IP",614]
["IP800","MF81T-C-150-HP","Tee Fitting, Carbon Steel, Hi Pres, 1-1/2\", IP",701]
["IP800","MF81T-C-200-H","Tee Fitting, Carbon Steel, Hi Pres, 2\", IP",785]
["IP800","MF81T-C-200-34-HP","Tee Fitting, Carbon Steel, Flanged Ends, Hi Pres, 2\", IP",1155]
["IP800","MF81T-S-050","Tee Fitting, 304 SS, 1/2\", IP ",565]
["IP800","MF81T-S-075","Tee Fitting, 304 SS, 3/4\", IP ",579]
["IP800","MF81T-S-100","Tee Fitting, 304 SS, 1\", IP ",603]
["IP800","MF81T-S-150","Tee Fitting, 304 SS, 1-1/2\", IP ",616]
["IP800","MF81T-S-200","Tee Fitting, 304 SS, 2\", IP ",637]
["IP800","MF81T-S-050-14","Tee Fitting, 316 SS, 1/2\", IP ",748]
["IP800","MF81T-S-075-14","Tee Fitting, 316 SS, 3/4\", IP ",761]
["IP800","MF81T-S-100-14","Tee Fitting, 316 SS, 1\", IP ",874]
["IP800","MF81T-S-150-14","Tee Fitting, 316 SS, 1-1/2\", IP ",903]
["IP800","MF81T-S-200-14","Tee Fitting, 316 SS, 2\", IP ",948]
["IP800","MF81T-S-050-HP","Tee Fitting, 304 SS, Hi Pres, 1/2\", IP ",616]
["IP800","MF81T-S-075-HP","Tee Fitting, 304 SS, Hi Pres, 3/4\", IP ",632]
["IP800","MF81T-S-100-HP","Tee Fitting, 304 SS, Hi Pres, 1\", IP ",637]
["IP800","MF81T-S-150-HP ","Tee Fitting, 304 SS, Hi Pres, 1-1/2\", IP ",649]
["IP800","MF81T-S-200-HP","Tee Fitting, 304 SS, Hi Pres, 2\", IP ",662]
["IP800","MF81T-S-050-14-HP ","Tee Fitting, 316 SS, Hi Pres, 1/2\", IP ",870]
["IP800","MF81T-S-075-14-HP","Tee Fitting, 316 SS, Hi Pres, 3/4\", IP ",910]
["IP800","MF81T-S-100-14-HP","Tee Fitting, 316 SS, Hi Pres, 1\", IP ",958]
["IP800","MF81T-S-150-14-HP","Tee Fitting, 316 SS, Hi Pres, 1-1/2\", IP ",983]
["IP800","MF81T-S-200-14-HP","Tee Fitting, 316 SS, Hi Pres, 2\", IP ",1016]
["IP800","MF81T-S-200-20","Tee Fitting, 304 SS, 2\", Flanged Ends, IP ",1046]
["IP800","MF81T-S-200-20-HP","Tee Fitting, 304 SS,Flanged Ends, Hi Pres, 2\", IP ",1119]
["IP800","MF81T-S-200-14-20-HP","Tee Fitting, 316 SS, Flanged Ends, Hi Pres, 2\", IP ",1368]
[null,"IP800 Series Saddle Fittings"]
["IP800","MF82S-F-300","Saddle, Iron, 3\", (3.45 - 4.05 O.D. range)",309]
["IP800","MF82S-F-400","Saddle, Iron, 4\", (4.00 - 4.50 O.D. range)",343]
["IP800","MF82S-F-600","Saddle, Iron, 6\", (6.00 - 6.63 O.D. range)",398]
["IP800","MF82S-F-800","Saddle, Iron, 8\", (8.00 - 8.63 O.D. range)",425]
["IP800","MF82S-B-300","Saddle, Bronze, 3\"",566]
["IP800","MF82S-B-400","Saddle, Bronze, 4\"",623]
["IP800","MF82S-P-300","Saddle, PVC, 3\"",172]
["IP800","MF82S-P-400","Saddle, PVC, 4\"",201]
["IP800","MF82S-P-600","Saddle, PVC, 6\"",236]
["IP800","MF82S-P-800","Saddle, PVC, 8\"",269]
["IP800","MF82S-P-300-16","Saddle, PVC, 3\",w/ 16\" Length Pipe Stub",224]
["IP800","MF82S-P-400-16","Saddle, PVC, 4\",w/ 16\" Length Pipe Stub",253]
["IP800","MF82S-P-600-16","Saddle, PVC, 6\",w/ 16\" Length Pipe Stub",292]
["IP800","MF82S-P-800-16","Saddle, PVC, 8\",w/ 16\" Length Pipe Stub",337]
[null,"IP800 Series Weld/Braze Fittings"]
["IP800","MF82W-B-300","Weldolet, Brass, 3\"",179]
["IP800","MF82W-B-400","Weldolet, Brass, 4\"",179]
["IP800","MF82W-B-600","Weldolet, Brass, 6\"",179]
["IP800","MF82W-B-800","Weldolet, Brass, 8\"",179]
["IP800","MF82W-C-300","Weldolet, Carbon Steel, 3\"",190]
["IP800","MF82W-C-400","Weldolet, Carbon Steel, 4\"",190]
["IP800","MF82W-C-600","Weldolet, Carbon Steel, 6\"",190]
["IP800","MF82W-C-800","Weldolet, Carbon Steel, 8\"",190]
["IP800","MF82W-C-300-HP","Weldolet, Carbon Steel, Hi Pres, 3\"",207]
["IP800","MF82W-C-400-HP","Weldolet, Carbon Steel, Hi Pres, 4\"",207]
["IP800","MF82W-C-600-HP","Weldolet, Carbon Steel, Hi Pres, 6\"",207]
["IP800","MF82W-C-800-HP","Weldolet, Carbon Steel, Hi Pres, 8\"",207]
["IP800","MF82W-S-300","Weldolet, 316 SS, 3\"",256]
["IP800","MF82W-S-400","Weldolet, 316 SS, 4\"",256]
["IP800","MF82W-S-600","Weldolet, 316 SS, 6\"",256]
["IP800","MF82W-S-800","Weldolet, 316 SS, 8\"",256]
["IP800","MF82W-S-300-HP","Weldolet, 316 SS, Hi Pres, 3\"",276]
["IP800","MF82W-S-400-HP","Weldolet, 316 SS, Hi Pres, 4\"",276]
["IP800","MF82W-S-600-HP","Weldolet, 316 SS, Hi Pres, 6\"",276]
["IP800","MF82W-S-800-HP","Weldolet, 316 SS, Hi Pres, 8\"",276]
[null,"IP800 Series Parts & Accessories"]
["IP800",100251,"Cap, Blind, Brass, EX/IP/TX800 Series",72]
["IP800",100249,"Cap, Blind, Polypro, EX/IP/TX800 series",49]
["IP800",100248,"Cap, Blind, PVC, EX/IP/TX800 series",49]
["IP800",100250,"Cap, Blind, SS, EX/IP/TX800 series",97]
["IP800",101850,"Strain Relief Kit Large, 1/2\", NPT",21]
["IP800",102021,"Hinged Display Cover Kit",64]
["IP800",104027,"Security Hinged Display Cover Kit",64]
["IP800",103702,"White Housing Screw/Washer Kit",4]
["IP800",100264,"O-Ring, EPDM, Sensor Shaft",17]
["IP800",100219,"O-Ring, Viton®, Brown",21]
["IP800",100317,"Rotor Repair Kit, Kynar® Tungsten Carbide, 6 Magnet, High-Res",163]
["IP800",100556,"Rotor Repair Kit, Kynar® Silicon Carbide, 6 Magnet, High-Res",223]
["IP800",100043,"Rotor Repair Kit, Kynar® Ceramic, 6 Magnet, High-Res",251]
["IP800",103315,"Bearing Assembly Kit, IP/TX800, Kynar (Includes 2 Bearings)",83]
["IP800",100853,"Security Seal, w/12\" of Wire",5]
["IP800",100419,"Sensor Assy, Blue, Low Power, 18' (For External Powered Displays)",120]
["IP800",100508,"Sensor Assy, Grey Micropowered, 18' (For Battery Powered Displays)",202]
["IP800",100298,"Sensor Retaining Screw",39]
["IP800",100375,"Spanner Tool, Sensor, Retain Screw",70]
["IP800",104000,"Standard U-Clip",15]
["IP800",101776,"HP Retaining Pin (2 Required), For HP units only",29]
["IP800",100854,"Wire, for Security Seal, 12\" (For 3\" Only)",3]
["PE202","PE202-038","Electromagnetic Low Flow Meter, 3/8\"",1119]
["PE202","PE202-075","Electromagnetic Low Flow Meter, 3/4\"",1119]
["PE202",400,"High Resolution Output - pulse only = -400",105,"Not listed in the price book"]
["PE202",138,"5.5' embedded cable = -138",21,"Not listed in the price book"]
[null,"PE202 Series Parts & Accessories"]
["PE202",103411,"PE202 PVDF Adapter Kit 1/2\" FNPT ",48]
["PE202",103412,"PE202 PVDF Adapter Kit 1/4\" MNPT ",225]
["PE202",103413,"PE202 PP Adapter Kit 1/4\" MNPT ",117]
["PE202",103414,"PE202 PVDF Adapter Kit 3/8\" MNPT ",225]
["PE202",103415,"PE202 PP Adapter Kit 3/8\" MNPT ",117]
["PE202",103416,"PE202 PVDF Adapter Kit 1/2\" MNPT ",225]
["PE202",103417,"PE202 PP Adapter Kit 1/2\" MNPT ",117]
["PE202",103418,"PE202 PVDF Adapter Kit 3/4\" MNPT ",225]
["PE202",103419,"PE202 PP Adapter Kit 3/4\" MNPT ",117]
["PE202",101422,"PE Output Cable, 6 Meter, 8 Conductor, Shielded, Female ",89]
["S-Series","SES-050 ","Single Jet Low Flow Meter, 316 SS, 1/2\" ",1504]
["S-Series","SES-075 ","Single Jet Low Flow Meter, 316 SS, 3/4\" ",1504]
["S-Series","SES-100  ","Single Jet Low Flow Meter, 316 SS, 1\"",1598]
["S-Series","SPT-038","Single Jet Low Flow, PTFE, PTFE Cover, 3/8\"",881]
["S-Series","SPT-038-70","Single Jet Low Flow, PTFE, PTFE Cover, SAE Ports, 3/8\"",958]
["S-Series","SPT-038-117","Single Jet Low Flow, PTFE, PTFE Cover, BSP Threads, 3/8\"",952]
["S-Series","SPT-050","Single Jet Low Flow, PTFE, PTFE Cover, 1/2\"",881]
["S-Series","SPT-050-70","Single Jet Low Flow, PTFE, PTFE Cover, SAE Ports, 1/2\"",958]
["S-Series","SPT-050-117","Single Jet Low Flow, PTFE, PTFE Cover, BSP Threads, 1/2\"",952]
["S-Series","SPT-075","Single Jet Low Flow, PTFE, PTFE Cover, 3/4\"",881]
["S-Series","SPT-075-70","Single Jet Low Flow, PTFE, PTFE Cover, SAE Ports, 3/4\"",958]
["S-Series","SPT-075-117","Single Jet Low Flow, PTFE, PTFE Cover, BSP Threads, 3/4\"",952]
["S-Series","SPT-100","Single Jet Low Flow, PTFE, PTFE Cover, 1\"",881]
["S-Series","SPT-100-70","Single Jet Low Flow, PTFE, PTFE Cover, SAE Ports, 1\"",958]
["S-Series","SPT-100-117","Single Jet Low Flow, PTFE, PTFE Cover, BSP Threads, 1\"",952]
["S-Series","SPX-038","Single Jet Low Flow, Acrylic Cover, Polypro, 3/8\"",355]
["S-Series","SPX-038-70","Single Jet Low Flow, Acrylic Cover, SAE Ports, Polypro, 3/8\"",448]
["S-Series","SPX-038-116","Single Jet Low Flow, Acrylic Cover, BSP Threads, Polypro, 3/8\"",443]
["S-Series","SPX-050","Single Jet Low Flow, Acrylic Cover, Polypro, 1/2\"",355]
["S-Series","SPX-050-70","Single Jet Low Flow, Acrylic Cover, SAE Ports, Polypro, 1/2\"",448]
["S-Series","SPX-050-116","Single Jet Low Flow, Acrylic Cover, BSP Threads, Polypro, 1/2\"",443]
["S-Series","SPX-075","Single Jet Low Flow, Acrylic Cover, Polypro, 3/4\"",355]
["S-Series","SPX-075-70","Single Jet Low Flow, Acrylic Cover, SAE Ports, Polypro, 3/4\"",448]
["S-Series","SPX-075-116","Single Jet Low Flow, Acrylic Cover, BSP Threads, Polypro, 3/4\"",443]
["S-Series","SPX-100","Single Jet Low Flow, Acrylic Cover, Polypro, 1\"",355]
["S-Series","SPX-100-70","Single Jet Low Flow, Acrylic Cover, SAE Ports, Polypro, 1\"",448]
["S-Series","SPX-100-116","Single Jet Low Flow, Acrylic Cover, BSP Threads, Polypro, 1\"",443]
["S-Series","01","Rotor w/ Ceramic Shaft, PVDF, Kynar = -01",82]
["S-Series","04","Micropower Pickup = -04",0]
["S-Series","06","LMI 4-pin Connector = -06",37]
["S-Series","07","Seametrics Control Connector = -07",37]
["S-Series","12","Polypro Cover = -12",37]
["S-Series",13,"High Resolution = -13",44]
["S-Series",25,"Viton O-Ring, Teflon-coated, Purple = -25",37]
["S-Series",60,"Viton O-Ring, Brown = -60",19]
["S-Series",68,"Rotor with Kynar/Silicon Carbide Shaft = -68",130]
["S-Series",69,"EPDM O-Ring, Black = -69",19]
["S-Series",106,"Roytronic® Series-A 5-Pin Connector = -106",37]
[null,"S-Series Parts & Accessories"]
["S-Series",100219,"O-Ring, Viton®, Brown (SPX)",21]
["S-Series",100231,"Lens Assembly, Acrylic with Bearing, Pre-5/2005 (SPX)",161]
["S-Series",100232,"Lens Assembly, Polypro with Bearing, Pre-5/2005 (SPX)",179]
["S-Series",100264,"O-Ring, EPDM, Sensor Shaft",17]
["S-Series",100372,"Tool, Bearing Removal, SPX/SPT/SES",268]
["S-Series",100419,"Sensor Assy, Blue, Low Power, 18' (For External Powered Displays)",118]
["S-Series",100451,"Cable, Unshielded, 3 Con, Blue, Low Power, IP-TX-WT-S Series (Per Ft.)",3]
["S-Series",100453,"Rotor Repair Kit, Ceramic Shaft, 2 Magnet, High-Res",282]
["S-Series",100508,"Sensor Assy, Grey Micropowered, 18' (For Battery Powered Displays)",202]
["S-Series",100011,"Cable, Unshielded, 3 Con, Grey Micropower, IP-TX-WT-SPX, SPT, SES",3]
["S-Series",100970,"Lens Assembly, Acrylic with Bearing, Post-5/2005 (SPX)",129]
["S-Series",100971,"Lens Assembly, Polypro with Bearing, Post-5/2005 (SPX)",151]
["S-Series",100973,"O-Ring, Viton® Teflon Coated, Purple (SES,SPT)",41]
["S-Series",103308,"Kit, Capscrew 10-32 x 2\", Socket Head, SS (SPT)",23]
["S-Series",103313,"Bearing Assembly Kit, SPX/SPT/SES (Includes 2 Bearings)",83]
["S-Series",103314,"Kit, Screw, 10-24 x 1\", SS, S/H (SPX)",23]
["S-Series",103318,"Screw Kit, 1/4-20 x 0.625\", SH, SS (SES)",15]
["S-Series",103930,"Rotor Repair Kit, Ceramic Shaft, 2 Magnet, Low-Res",248]
["S-Series",103931,"Rotor Repair Kit, Tungsten Carbide, 2 Magnet, Low-Res (SES,SPX)",163]
["S-Series",103932,"Rotor Repair Kit, Tungsten Carbide, 6 Magnet, High-Res (SES,SPX)",200]
["S-Series",103933,"Rotor Repair Kit, Silicon Carbide, 2 Magnet, Low-Res",186]
["S-Series",103934,"Rotor Repair Kit, Silicon Carbide, 6 Magnet, High-Res",270]
[null,"In-line Turbine Meters"]
["WT Series","WTP100-300 ","In-Line Turbine Meter, PVC, 3\" Sensor Only ",1718]
["WT Series","WTP103-300 ","In-Line Turbine Meter, PVC, 3\", FT430 ",2233]
["WT Series","WTP107-300 ","In-Line Turbine Meter, PVC, 3\", FT450 ",2365]
["WT Series","WTP109-300 ","In-Line Turbine Meter, PVC, 3\", FT440 ",2314]
["WT Series","WTP100-400 ","In-Line Turbine Meter, PVC, 4\" Sensor Only ",1932]
["WT Series","WTP103-400 ","In-Line Turbine Meter, PVC, 4\", FT430 ",2424]
["WT Series","WTP107-400 ","In-Line Turbine Meter, PVC, 4\", FT450 ",2549]
["WT Series","WTP109-400 ","In-Line Turbine Meter, PVC, 4\", FT440 ",2502]
["WT Series","WTP100-600 ","In-Line Turbine Meter, PVC, 6\" Sensor Only ",2479]
["WT Series","WTP103-600 ","In-Line Turbine Meter, PVC, 6\", FT430 ",2972]
["WT Series","WTP107-600 ","In-Line Turbine Meter, PVC, 6\", FT450 ",3098]
["WT Series","WTP109-600 ","In-Line Turbine Meter, PVC, 6\", FT440 ",3050]
["WT Series","WTS100-300","In-Line Turbine Meter, 304 SS, 3\", Sensor Only",3441]
["WT Series","WTS103-300","In-Line Turbine Meter, 304 SS, 3\" FT430",3975]
["WT Series","WTS107-300","In-Line Turbine Meter, 304 SS, 3\", FT450",4113]
["WT Series","WTS109-300","In-Line Turbine Meter, 304 SS, 3\", FT440",4060]
["WT Series","WTS100-400","In-Line Turbine Meter, 304 SS, 4\", Sensor Only",3882]
["WT Series","WTS103-400","In-Line Turbine Meter, 304 SS, 4\" FT430",4412]
["WT Series","WTS107-400","In-Line Turbine Meter, 304 SS, 4\", FT450",4548]
["WT Series","WTS109-400","In-Line Turbine Meter, 304 SS, 4\", FT440",4496]
["WT Series","WTS100-600","In-Line Turbine Meter, 304 SS, 6\", Sensor Only",4632]
["WT Series","WTS103-600","In-Line Turbine Meter, 304 SS, 6\" FT430",5139]
["WT Series","WTS107-600","In-Line Turbine Meter, 304 SS, 6\", FT450",5121]
["WT Series","WTS109-600","In-Line Turbine Meter, 304 SS, 6\", FT440",5219]
["WT Series","WTS100-800","In-Line Turbine Meter, 304 SS, 8\", Sensor Only",5061]
["WT Series","WTS103-800","In-Line Turbine Meter, 304 SS, 8\" FT430",5592]
["WT Series","WTS107-800","In-Line Turbine Meter, 304 SS, 8\", FT450",5657]
["WT Series","WTS109-800","In-Line Turbine Meter, 304 SS, 8\", FT440",5610]
["WT Series","04","Micropower Pickup (100 Series Only) = -04",0]
["WT Series",64,"Non-resettable Total = -64",32]
["WT Series",98,"Dual Relay Output (FT430/440 only) = -98",69]
["WT Series",126,"Hinged Display Cover Kit = -126",63]
["WT Series",14,"3\" All 316 SS = -14",1009]
["WT Series",18,"3\" Flanged Ends = -18",147]
["WT Series",14,"4\" All 316 SS = -14",1197]
["WT Series",18,"4\" Flanged Ends = -18",186]
["WT Series",14,"6\" All 316 SS = -14",1629]
["WT Series",18,"6\" Flanged Ends = -18",276]
["WT Series",14,"8\" All 316 SS = -14",1935]
[null,"WT Series Parts & Accessories"]
["WT Series",100373,"Battery, Lithium, 3.6V, 8.5Ah, C Size",67]
["WT Series",101850,"Strain Relief Kit Large, 1/2\", NPT",21]
["WT Series",100364,"Strain Relief Kit, Small (Includes 2)",36]
["WT Series",100262,"Flange, Blanking, SS, 3-8\"",144]
["WT Series","103591-03","FT450 Replacement Module",551]
["WT Series","103591-02","FT440 Replacement Module",499]
["WT Series","103591-01","FT430 Replacement Module",420]
["WT Series",100411,"Gasket, Upper Housing",16]
["WT Series",102021,"Hinged Display Cover Kit",64]
["WT Series",100662,"Housing Assy, Upper, Blind (Gasket, Screws, Washers, Label)",63]
["WT Series",100264,"O-Ring, EPDM, Sensor Shaft",17]
["WT Series",100360,"Steel Housing Plug (Battery Units)",21]
["WT Series",100152,"Rotor & Bearings Assy, WT, Kynar® (3\" - 8\" sizes only)",331]
["WT Series",100333,"Rotor Repair Kit, WT, PVDF, Ceramic Shaft (3\" - 8\" sizes only)",369]
["WT Series",100414,"Screw/Washer Kit, Upper Housing (Qty 4)",3]
["WT Series",100853,"Security Seal, w/12\" of Wire",5]
["WT Series",100419,"Sensor Assy, Blue, Low Power, 18' (For External Powered Displays)",120]
["WT Series",100508,"Sensor Assy, Grey Micropowered, 18' (For Battery Powered Displays)",202]
["WT Series",100298,"Sensor Retaining Screw",39]
["WT Series",103312,"Shaft Assembly Kit, Ceramic, WT/TX (Includes 2 Shafts)",145]
["WT Series",100375,"Spanner Tool, Sensor, Retain Screw",70]
["WT Series",100154,"U-Clip, Retainer",30]
["WT Series",100854,"Wire, for Security Seal, 12\" (For 3\" Only)",3]
["WT Series",100238,"Body, WTP-200-18",476]
["WT Series",100239,"Body, WTP-300-18",626]
["WT Series",100240,"Body, WTP-400-18",789]
["WT Series",100241,"Body, WTP-600-18",1090]
["WT Series",100437,"Insert Assy, WTP 2\"",969]
["WT Series",100438,"Insert Assy, WTP 3\"",1017]
["WT Series",100439,"Insert Assy, WTP 4\"- 6\"",1096]
["WT Series",103309,"Kit, 1/4-20 x 1\" M/S, SS, WT",15]
["WT Series",100214,"O-Ring, EPDM, Black",21]
["WT Series",100262,"Flange, Blanking, SS, 3-8\"",144]
["WT Series",101446,"Insert Assy, WTC/WTS 2\"",1040]
["WT Series",100440,"Insert Assy, WTS, 3\" to 8\"",1175]
["WT Series",100270,"O-Ring, EPDM, Black",24]
["WT Series",100327,"Rotor, Kynar®, Ceramic Shaft",322]
["WT Series",100325,"Rotor Repair Kit, TX, Kynar®, Ceramic Shaft (Rotor, Bearings, Shaft)",362]
["WT Series",101862,"Rotor Assy, Kynar® w/ Carbide Shaft, TX",163]
["WT Series",101912,"Rotor Repair Kit, TX, Kynar®, Carbide Shaft (Rotor, Bearings, Shaft)",192]
["AG3000 Base","AG3000-0200","Flanged In-Line MagMeter w/ Integral Display, Base Model",1699]
["AG3000 Base","AG3000-0300","Flanged In-Line MagMeter w/ Integral Display, Base Model",1788]
["AG3000 Base","AG3000-0400","Flanged In-Line MagMeter w/ Integral Display, Base Model",1917]
["AG3000 Base","AG3000-0600","Flanged In-Line MagMeter w/ Integral Display, Base Model",2056]
["AG3000 Base","AG3000-0800","Flanged In-Line MagMeter w/ Integral Display, Base Model",2370]
["AG3000 Base","AG3000-1000","Flanged In-Line MagMeter w/ Integral Display, Base Model",2796]
["AG3000 Base","AG3000-1200","Flanged In-Line MagMeter w/ Integral Display, Base Model",3357]
["AG3000 Base","L","4-20mA",169]
["AG3000 Base","H","Hart 4-20mA",268]
["AG3000 Base","S","Modbus",360]
["AG3000 Base","01","Data Logger",85]
["AG3000 Base","0068","6 Meter (20 ft.) Power/Output Cable, 8 Pin",133]
["AG3000 Base","0158","15 Meter (50 ft.) Power/Output Cable, 8 Pin",206]
["AG3000 Base","0308","30 Meter (100 ft.) Power/Output Cable, 8 Pin",338]
["AG3000 Base","0458","45 Meter (150 ft.) Power/Output Cable, 8 Pin",482]
["AG3000 Base","0608","60 Meter (200 ft.) Power/Output Cable, 8 Pin",625]
["AG3000 Base","0064","6 Meter (20 ft.) Power/Output Cable, 4 Pin",107]
["AG3000 Base","0154","15 Meter (50 ft.) Power/Output Cable, 4 Pin",171]
["AG3000 Base","0304","30 Meter (100 ft.) Power/Output Cable, 4 Pin",284]
["AG3000 Base","0454","45 Meter (150 ft.) Power/Output Cable, 4 Pin",404]
["AG3000 Base","0604","60 Meter (200 ft.) Power/Output Cable, 4 Pin",525]
["AG3000 Premium","AG3000p-0200","Flanged In-Line MagMeter w/ Integral Display, Premium Model",2309]
["AG3000 Premium","AG3000p-0300","Flanged In-Line MagMeter w/ Integral Display, Premium Model",2431]
["AG3000 Premium","AG3000p-0400","Flanged In-Line MagMeter w/ Integral Display, Premium Model",2576]
["AG3000 Premium","AG3000p-0600","Flanged In-Line MagMeter w/ Integral Display, Premium Model",2729]
["AG3000 Premium","AG3000p-0800","Flanged In-Line MagMeter w/ Integral Display, Premium Model",2927]
["AG3000 Premium","AG3000p-1000","Flanged In-Line MagMeter w/ Integral Display, Premium Model",3372]
["AG3000 Premium","AG3000p-1200","Flanged In-Line MagMeter w/ Integral Display, Premium Model",4290]
["AG3000 Premium","A1","AC Power (1.8 Meter (6ft.) AC power cord included)",135]
["AG3000 Premium","H","Hart 4-20mA",281]
["AG3000 Premium","S","Modbus",360]
["AG3000 Premium","01","Data Logger",85]
["AG3000 Premium","006D","DC Power/Output Cable, 6 Meter (20 ft.), 8 Con",214]
["AG3000 Premium","015D","DC Power/Output Cable, 15 Meter (50 ft.), 8 Con",382]
["AG3000 Premium","030D","DC Power/Output Cable, 30 Meter (100 ft.), 8 Con",664]
["AG3000 Premium","045D","DC Power/Output Cable, 45 Meter (150 ft.), 8 Con",945]
["AG3000 Premium","060D","DC Power/Output Cable, 60 Meter (200 ft.), 8 Con",1226]
["AG3000 Premium","006S","DC Power/Output Cable, 6 Meter (20 ft.), 8 Con",107]
["AG3000 Premium","015S","DC Power/Output Cable, 15 Meter (50 ft.), 8 Con",192]
["AG3000 Premium","030S","DC Power/Output Cable, 30 Meter (100 ft.), 8 Con",332]
["AG3000 Premium","045S","DC Power/Output Cable, 45 Meter (150 ft.), 8 Con",473]
["AG3000 Premium","060S","DC Power/Output Cable, 60 Meter (200 ft.), 8 Con",612]
["AG3000 Remote","AG3000r-0200","Flanged In-Line MagMeter w/ Remote Display",3057]
["AG3000 Remote","AG3000r-0300","Flanged In-Line MagMeter w/ Remote Display",3170]
["AG3000 Remote","AG3000r-0400","Flanged In-Line MagMeter w/ Remote Display",3288]
["AG3000 Remote","AG3000r-0600","Flanged In-Line MagMeter w/ Remote Display",3409]
["AG3000 Remote","AG3000r-0800","Flanged In-Line MagMeter w/ Remote Display",3641]
["AG3000 Remote","AG3000r-1000","Flanged In-Line MagMeter w/ Remote Display",4062]
["AG3000 Remote","AG3000r-1200","Flanged In-Line MagMeter w/ Remote Display",5375]
["AG3000 Remote","A1","AC Power (1.8 Meter (6ft.) AC power cord included)",135]
["AG3000 Remote","L","4-20mA",169]
["AG3000 Remote","H","Hart 4-20mA",281]
["AG3000 Remote","S","Modbus",360]
["AG3000 Remote","01","Data Logger",85]
["AG3000 Remote","006D","6 Meter (20 ft.) Power/Output Cable, 6 Con (Qty 2)",169]
["AG3000 Remote","015D","15 Meter (50 ft.) Power/Output Cable, 6 Con (Qty 2)",305]
["AG3000 Remote","030D","30 Meter (100 ft.) Power/Output Cable, 6 Con (Qty 2)",529]
["AG3000 Remote","045D","45 Meter (150 ft.) Power/Output Cable, 6 Con (Qty 2)",754]
["AG3000 Remote","060D","60 Meter (200 ft.) Power/Output Cable, 6 Con (Qty 2)",979]
["AG3000 Remote","006S","6 Meter (20 ft.) Power/Output Cable, 6 Con",85]
["AG3000 Remote","015S","15 Meter (50 ft.) Power/Output Cable, 6 Con ",152]
["AG3000 Remote","030S","30 Meter (100 ft.) Power/Output Cable, 6 Con",265]
["AG3000 Remote","045S","45 Meter (150 ft.) Power/Output Cable, 6 Con",377]
["AG3000 Remote","060S","60 Meter (200 ft.) Power/Output Cable, 6 Con",489]
["AG3000 Remote","006","6 Meter (20 ft.) Sensor Cable",85]
["AG3000 Remote","015","15 Meter (50 ft.) Sensor Cable",152]
["AG3000 Remote","030","30 Meter (100 ft.) Sensor Cable",265]
["AG3000 Remote","045","45 Meter (150 ft.) Sensor Cable",377]
["AG3000 Remote","060","60 Meter (200 ft.) Sensor Cable",489]
["AG90","AG90-0400","4 Inch",1410]
["AG90","AG90-0600","6 Inch",1466]
["AG90","AG90-0800","8 Inch",1521]
["AG90","AG90-1000","10 Inch",1605]
["AG90","AG90-1200","12 Inch",1675]
["AG90","0064","6 Meter (20 ft.) Power/Output Cable, 4 Pin",107]
["AG90","0154","15 Meter (50 ft.) Power/Output Cable, 4 Pin",171]
["AG90","0304","30 Meter (100 ft.) Power/Output Cable, 4 Pin",284]
["AG90","0454","45 Meter (150 ft.) Power/Output Cable, 4 Pin",404]
["AG90","0604","60 Meter (200 ft.) Power/Output Cable, 4 Pin",525]
["AG90","01","Data Logger",85]
["AG90","103977-04","4 Inch Saddle (4.00\" - 4.90\" O.D. range) ",159]
["AG90","103977-06","6 Inch Saddle (6.00\" - 6.90\" O.D. range) ",185]
["AG90","103977-08","8 Inch Saddle (8.00\" - 9.05\" O.D. range) ",203]
["AG90","103977-10","10 Inch Saddle (10.40\" - 11.10\" O.D. range) ",224]
["AG90","103977-12","12 Inch Saddle (12.10\" - 13.20\" O.D. range) ",239]
["AG90","104084-04","4 Inch Saddle Gasket ",13]
["AG90","104084-06","6 Inch Saddle Gasket ",15]
["AG90","104084-08","8 Inch Saddle Gasket ",18]
["AG90","104084-1012","10 or 12 Inch Saddle Gasket ",21]
["AG90",103971,"Battery Replacement Kit, (2) D-Cell",126]
["AG90",104009,"Security U-Clip Kit",36]
["AG90",100264,"O-Ring, EPDM, Sensor Shaft",17]
["AG90","103038-03-245"," O-Ring, EPDM, Display Housing",8]
["AG90",103500,"Security Seal, Plastic Padlock",2]
["AG90",104073,"Security Tab",2]
["AG90","103490-01","01 Display Cover, White",14]
["AG90","103709-01","01 Display Cover Kit, with Lanyard & Split Key Ring",36]
["AG90",103984,"Hinged Display Cover Kit",36]
["AG90","DC4-USB","Data Logger Download Cable, IP68",207]
["AG90","DC5-USB","Data Logger Download Cable, IP68",200]
["AG90",102009,"Data Logger Connector Cap",23]
["AG90",100248,"Cap, Blind, PVC, EX/IP/TX800 series",49]
["AG90",100249,"Cap, Blind, Polypro, EX/IP/TX800 series",49]
["AG90",100250,"Cap, Blind, SS, EX/IP/TX800 series",97]
["AG90",100251,"Cap, Blind, Brass, EX/IP/TX800 Series",72]
[null,"Cables & Connectors"]
["All",100852,"Cable, Shielded, 4-Con, EX W/O Reverse Flow (Per Ft.)",5]
["All",100835,"Cable, Shielded, 6-Con, EX W/ Reverse Flow (Per Ft.)",6]
["All",100010,"Cable, Unshielded, 2 Con, MJ-WJ-AO55 (Per Ft.)",3]
["All",100451,"Cable, Unshielded, 3 Con, Blue, Low Power, IP-TX-WT-S Series (Per Ft.)",3]
["All",100011,"Cable, Unshielded, 3 Con, Grey Micropower (IP,TX,WT,SPX,SPT,SES)",3]
["All",100014,"Cable, Unshielded, 4 Con, FT440, (Per Ft.)",4]
["All",100649,"Cable, Unshielded, 3 Con, MJE (Per Ft.)",3]
["All",100008,"Connector, Female, LMI 4pin, Female",40]
["All",100006,"Connector, Seametrics 3-Pin BulkHead",40]
["All",100007,"Connector, Seametrics 3-Pin Cable End",40]
["All",101783,"Roytronics® Series-A Pump 5 Pin Connector",41]
[null,"Cables & Connectors Assemblies"]
["All",100039,"Cable Assy, 12' Unshielded, 2 Con, LMI 4-Pin Connector",54]
["All",100013,"Cable Assy, 12' Unshielded, 3 Con, LMI 4-Pin Connector, 1K Resistor",54]
["All",100395,"Cable Assy, 12' Unshielded, 2 Con, Seametrics 3-Pin Connector",54]
["All",100041,"Cable Assy, 12' Unshielded, 3 Con, Seametrics 3-Pin Connector",54]
["All",101587,"Cable Assy, 12' Unshielded, 2 Con, LMI 5-Pin Connector",54]
["All",101576,"Cable Assy, 12' Unshielded, 3 Con, LMI 5-Pin Connector",54]
["All",100044,"Sensor Assy, MJR, Single Reed Switch, LMI Pump 4-Pin Connector",113]
["All",100045,"Sensor Assy, MJR, Dual Reed Switch, LMI Pump 4-Pin Connector",123]
["All",100049,"Sensor Assy, MJE, Single Hall Effect, LMI Pump 4-Pin Connector",113]
["All",100046,"Sensor Assy, MJR, Single Reed Switch, Seametrics Control Connector",113]
["All",100047,"Sensor Assy, MJR, Dual Reed Switch, Seametrics Control Connector",123]
["All",100048,"Sensor Assy, MJE, Single Hall Effect, Seametrics Control Cable",113]
["All",101588,"Sensor Assy, MJR, Single Reed Switch, LMI Pump 5-Pin Connector",113]
["All",101589,"Sensor Assy, MJR, Dual Reed SW, LMI Pump 5-Pin Connector",113]
["All",101590,"Sensor Assy, MJE, Single Hall Effect, LMI Pump 5-Pin Connector",123]
[]
["iMAG 4700 / AG3000","104097-006","DC Power/Output or Sensor Cable, 6 Meter (20 ft.), 8 Pin",133,null,null,null,null,null,null,102]
["iMAG 4700 / AG3000","104097-015","DC Power/Output or Sensor Cable, 15 Meter (50 ft.), 8 Pin",206,null,null,null,null,null,null,163]
["iMAG 4700 / AG3000","104097-030","DC Power/Output or Sensor Cable, 30 Meter (100 ft.), 8 Pin",338,null,null,null,null,null,null,270]
["iMAG 4700 / AG3000","104097-045","DC Power/Output or Sensor Cable, 45 Meter (150 ft.), 8 Pin",482,null,null,null,null,null,null,385]
["iMAG 4700 / AG3000","104097-060","DC Power/Output or Sensor Cable, 60 Meter (200 ft.), 8 Pin",625,null,null,null,null,null,null,500]
["iMAG 4700 / AG3000","104094-006","DC Power/Output or Sensor Cable, 6 Meter (20 ft.), 4 Pin",107,null,null,null,null,null,null,127]
["iMAG 4700 / AG3000","104094-015","DC Power/Output or Sensor Cable, 15 Meter (50 ft.), 4 Pin",171,null,null,null,null,null,null,196]
["iMAG 4700 / AG3000","104094-030","DC Power/Output or Sensor Cable, 30 Meter (100 ft.), 4 Pin",284,null,null,null,null,null,null,322]
["iMAG 4700 / AG3000","104094-045","DC Power/Output or Sensor Cable, 45 Meter (150 ft.), 4 Pin",404,null,null,null,null,null,null,459]
["iMAG 4700 / AG3000","104094-060","DC Power/Output or Sensor Cable, 60 Meter (200 ft.), 4 Pin",525,null,null,null,null,null,null,595]
["iMAG 4700 / AG3000","103706-006","DC Power/Output Cable, 6 Meter (20 ft.), 8 Con",109]
["iMAG 4700 / AG3000","103706-015","DC Power/Output Cable, 15 Meter (50 ft.), 8 Con",196]
["iMAG 4700 / AG3000","103706-030","DC Power/Output Cable, 30 Meter (100 ft.), 8 Con",338]
["iMAG 4700 / AG3000","103706-045","DC Power/Output Cable, 45 Meter (150 ft.), 8 Con",482]
["iMAG 4700 / AG3000","103706-060","DC Power/Output Cable, 60 Meter (200 ft.), 8 Con",625]
["iMAG 4700 / AG3000",103701,"AC Power/Output Cable 1.8 Meter (6 ft.), Includes wall outlet plug",15]
["iMAG 4700 / AG3000","103149-006","AC Power/Output Cable 6 Meter (20 ft.), Cable Only",46]
["iMAG 4700 / AG3000","103149-015","AC Power/Output Cable 15 Meter (50 ft.), Cable Only",114]
["iMAG 4700 / AG3000","103149-030","AC Power/Output Cable 30 Meter (100 ft.), Cable Only",229]
["iMAG 4700 / AG3000","103149-045","AC Power/Output Cable 45 Meter (150 ft.), Cable Only",343]
["iMAG 4700 / AG3000","103149-060","AC Power/Output Cable 60 Meter (200 ft.), Cable Only",459]
["iMAG 4700 / AG3000","104124 (1)","Grounding Ring, Magmeter, 2\"",107]
["iMAG 4700 / AG3000","102157 (1)","Grounding Ring, Magmeter, 3\"",119]
["iMAG 4700 / AG3000","100876 (1)","Grounding Ring, Magmeter, 4\"",126]
["iMAG 4700 / AG3000","100877 (1)","Grounding Ring, Magmeter 6\"",132]
["iMAG 4700 / AG3000","100878 (1)","Grounding Ring, Magmeter 8\"",141]
["iMAG 4700 / AG3000","100879 (1)","Grounding Ring, Magmeter 10\"",198]
["iMAG 4700 / AG3000","103288 (1)","Grounding Ring, Magmeter 12\"",202]
["iMAG 4700 / AG3000","103922-15","15-Pin Connector Kit",38]
["iMAG 4700 / AG3000",103971,"Battery Replacement Kit, (2) D-Cell",126]
["iMAG 4700 / AG3000",103500,"Security Seal, Plastic Padlock",2]
["iMAG 4700 / AG3000",100854,"Wire, for Security Seal, 12\" (For 3\" Only)",3]
["iMAG 4700 / AG3000",104073,"Security Tab",2]
["iMAG 4700 / AG3000","103490-01","Display Cover, White",14]
["iMAG 4700 / AG3000","103709-01","Display Cover Kit, with Lanyard & Split Key Ring",36]
["iMAG 4700 / AG3000",103984,"Hinged Display Cover Kit",36]
["iMAG 4700 / AG3000",103166,"Housing Plug, Black, Qty 1 (includes O-Ring)",7]
["iMAG 4700 / AG3000","103028-01","Cable Strain Relief, Qty 1 (Includes O-Ring)",12]
["iMAG 4700 / AG3000","103038-03-245","O-Ring, EPDM, Display Housing",8]
["iMAG 4700 / AG3000","103105-04-05","O-Ring, EPDM 80 Duro",2]
["iMAG 4700 / AG3000","103517-02","Data Logger Connector (For base models prior 8/2017, DC4 USB required)",87]
["iMAG 4700 / AG3000","103951-02","Data Logger Connector (For base models after 8/2017, DC4 USB required)",87]
["iMAG 4700 / AG3000","103517-01","Data Logger Connector (For all \"p\" and \"r\" models, DC4 USB required)",87]
["iMAG 4700 / AG3000","DC4-USB","Data Logger Download Cable, IP68",207]
["iMAG 4700 / AG3000","DC5-USB","Data Logger Download Cable, IP68",200]
["iMAG 4700 / AG3000",102009,"Data Logger Connector Cap",23]
[null,"iMAG 4700 Gasket Kits (Includes Two Gaskets)"]
["iMAG 4700 / AG3000","104035-02","Gasket Kit, Flanged Magmeter, 2\"",16]
["iMAG 4700 / AG3000","104035-03","Gasket Kit, Flanged Magmeter, 3\"",19]
["iMAG 4700 / AG3000","104035-04","Gasket Kit, Flanged Magmeter, 4\"",20]
["iMAG 4700 / AG3000","104035-06","Gasket Kit, Flanged Magmeter, 6\"",25]
["iMAG 4700 / AG3000","104035-08","Gasket Kit, Flanged Magmeter, 8\"",30]
["iMAG 4700 / AG3000","104035-10","Gasket Kit, Flanged Magmeter, 10\"",41]
["iMAG 4700 / AG3000","104035-12","Gasket Kit, Flanged Magmeter, 12\"",48]
[null,"iMAG 4700 Gasket Kits, NSF (Includes Two Gaskets)"]
["iMAG 4700","104036-02","Gasket Kit, Flanged Magmeter, NSF, 2\"",36]
["iMAG 4700","104036-03","Gasket Kit, Flanged Magmeter, NSF, 3\"",48]
["iMAG 4700","104036-04","Gasket Kit, Flanged Magmeter, NSF, 4\"",66]
["iMAG 4700","104036-06","Gasket Kit, Flanged Magmeter, NSF, 6\"",95]
["iMAG 4700","104036-08","Gasket Kit, Flanged Magmeter, NSF, 8\"",139]
["iMAG 4700","104036-10","Gasket Kit, Flanged Magmeter, NSF, 10\"",183]
["iMAG 4700","104036-12","Gasket Kit, Flanged Magmeter, NSF, 12\"",275]
[null,"iMAG 4700 Grounding Ring & Gasket Kits, (Includes Two Gaskets and Two Grounding Rings)"]
["iMAG 4700 / AG3000","104039-02","Grounding Ring/Gasket Kit, Flanged Magmeter, 2\"",245]
["iMAG 4700 / AG2999","104039-03","Grounding Ring/Gasket Kit, Flanged Magmeter, 3\"",258]
["iMAG 4700 / AG3000","104039-04","Grounding Ring/Gasket Kit, Flanged Magmeter, 4\"",273]
["iMAG 4700 / AG3000","104039-06","Grounding Ring/Gasket Kit, Flanged Magmeter, 6\"",292]
["iMAG 4700 / AG3000","104039-08","Grounding Ring/Gasket Kit, Flanged Magmeter, 8\"",311]
["iMAG 4700 / AG3000","104039-10","Grounding Ring/Gasket Kit, Flanged Magmeter, 10\"",435]
["iMAG 4700 / AG3000","104039-12","Grounding Ring/Gasket Kit, Flanged Magmeter, 12\"",449]
[null,"iMAG 4700 Grounding Ring & Gasket Kits, NSF (Includes Two Gaskets and Two Grounding Rings)"]
["iMAG 4700","104040-02","Grounding Ring/Gasket Kit, Flanged Magmeter, NSF, 2\"",257]
["iMAG 4699","104040-03","Grounding Ring/Gasket Kit, Flanged Magmeter, NSF, 3\"",287]
["iMAG 4700","104040-04","Grounding Ring/Gasket Kit, Flanged Magmeter, NSF, 4\"",319]
["iMAG 4700","104040-06","Grounding Ring/Gasket Kit, Flanged Magmeter, NSF, 6\"",361]
["iMAG 4700","104040-08","Grounding Ring/Gasket Kit, Flanged Magmeter, NSF, 8\"",418]
["iMAG 4700","104040-10","Grounding Ring/Gasket Kit, Flanged Magmeter, NSF, 10\"",579]
["iMAG 4700","104040-12","Grounding Ring/Gasket Kit, Flanged Magmeter, NSF, 12\"",677]
["FT400 Series","FT430W","DC Powered, Scaled Pulse & Pulse Passthrough Output, Wall Mount",446]
["FT400 Series","FT430P","DC Powered, Scaled Pulse & Pulse Passthrough Output, Panel Mount",420]
["FT400 Series","FT440W","Loop Powered, Dual Scaled Pulse Output & 4-20 mA Output, Wall Mount",578]
["FT400 Series","FT440P","Loop Powered, Dual Scaled Pulse Output & 4-20 mA Output, Panel Mount",499]
["FT400 Series","FT450W","Battery Powered, Scaled Pulse & Pulse Passthrough Output, Wall Mount",593]
["FT400 Series",32,"Tamper Evident Kit, Wire, Seal",35]
["FT400 Series",64,"Non- Resttable Total",32]
["FT400 Series",98,"Dual Relay Output (FT430/440 only)",69]
["FT400 Series",126,"Hinged Display Cover Kit",63]
["FT400 Series",139,"Built-In Dual Power Supply (FT430W/440W)",308]
["FT400 Series",140,"Built-In Single Power Supply (FT430W or FT440W w/ mech.",160]
["FT430/440/450 Parts & Accessories"]
["FT400 Series","103591-01","FT430 Replacement Module",420]
["FT400 Series","103591-02","FT440 Replacement Module",499]
["FT400 Series","103591-03","FT450 Replacement Module",551]
["FT400 Series",103391,"Adapter Kit: New FT to old lower housing, Standard",120]
["FT400 Series",103392,"Adapter Kit: New FT to old lower housing, Tamper Evident",145]
["FT400 Series",103594,"MK15, Wall to Meter Mount Kit, FT430/440/450",140]
["FT400 Series",103396,"MK25, Meter to Wall Mount Kit, FT430/440/450",211]
["FT400 Series",102021,"Hinged Display Cover Kit",64]
["FT400 Series",104027,"Security Hinged Display Cover Kit",64]
["FT400 Series",100013,"Cable Assy, 12' Unshielded, 3 Con, LMI 4-Pin Connector, 1K Resistor",54]
["FT400 Series",100039,"Cable Assy, 12' Unshielded, 2 Con, LMI 4-Pin Connector",54]
["FT400 Series",103702,"White Housing Screw/Washer Kit",4]
["FT400 Series","PC42","Dual Power Converter 110-115 Vac, 12-24 Vdc, Regulated",353]
["FT400 Series","PC3","110-115 Vac, 24 Vdc, Unregulated",80]
["FT400 Series",100373,"Battery, Lithium, 3.6V, 8.5Ah, C Size",67]
["FT400 Series",102025,"Upper Housing Seal",21]
["FT400 Series",100360,"Steel Housing Plug (Battery Units)",21]
["FT400 Series",103811,"Cover Hardware Kit for FT430P/FT440P",13]

{"sheet":"Quote Template","index":19,"n_rows":35,"n_cols":10,"rows_kept":35,"cut":false,"hidden":false,"merged":[[13,2,13,7],[14,2,14,7],[15,2,15,7],[36,0,36,9],[28,0,28,9],[29,0,29,9],[30,0,30,9],[31,0,31,9],[32,0,32,9],[33,0,33,9],[27,0,27,9],[26,0,26,9],[24,2,24,8],[34,0,34,9],[35,0,35,9],[25,0,25,9],[21,2,21,7],[22,2,22,7],[23,2,23,7],[16,2,16,7],[17,2,17,7],[18,2,18,7],[19,2,19,7],[20,2,20,7],[0,0,0,9],[1,2,1,7],[2,2,2,7],[3,2,3,9],[4,0,5,1],[4,2,5,6],[4,8,4,9],[5,8,5,9],[6,0,6,9],[7,3,7,7],[8,2,8,7],[9,2,9,7],[12,2,12,7],[10,2,10,7],[11,2,11,7]]}
[]
["Name:",null,{"$f":"IF('Interactive Form'!A1=\"\",\" \",'Interactive Form'!A1)","v":"Joseph Customer"},null,null,null,null,null,"Date:",{"$f":"IF('Interactive Form'!C5=\"\",\" \",'Interactive Form'!C5)","v":"2021-01-01"}]
["Company:",null,{"$f":"IF('Interactive Form'!A3=\"\",\" \",'Interactive Form'!A3)","v":"Seattle Treatment Plant"},null,null,null,null,null,"Phone:",{"$f":"IF('Interactive Form'!E5=\"\",\" \",'Interactive Form'!E5)","v":"757-416-8400"}]
["Address:",null,{"$f":"_xlfn.TEXTJOIN(\" \",TRUE,'Interactive Form'!A7:F7)","v":"19026 72nd Ave S. Kent WA 98032"}]
["Email:",null,{"$f":"IF('Interactive Form'!C3=\"\",\" \",'Interactive Form'!C3)","v":"place your orders with seametrics.com"},null,null,null,null,"Project:",{"$f":"'Interactive Form'!C1","v":"Magnetic Flow meter"}]
[null,null,null,null,null,null,null,"Quote #:",{"$f":"IF('Interactive Form'!E1=\"\",\" \",'Interactive Form'!E1)","v":"01012021ST-1"}]
[]
["Line","Qty","P/N","Description",null,null,null,null,"List Price","Total"]
[null,null,{"$f":"'EX800'!F1","v":"Please SelectPlease Select"},null,null,null,null,null,{"$f":"'EX800'!G3","v":{"$error":"#N/A"}}]
[]
[]
[]
[]
[]
[]
[]
[]
[]
[]
[]
[]
[]
[]
[]
[]
[]
[]
[]
[]
[]
[]
["*** Standard Lead Time is 2 weeks ARO but will be confirmed at time of order***"]
[]
["Payment Terms: NET 30"]
["FOB Kent, WA Pricing good for 2021"]

{"sheet":"Version History","index":20,"n_rows":19,"n_cols":5,"rows_kept":19,"cut":false,"hidden":false,"merged":[]}
["Date","Rev #","Revision Scope","Reviser","Extended Notes"]
["2020-04-13",1,"Added iMAG and AG3000 parts and accessories below table","TEN","This was identified by Paul Carlson and is to maintain consistency between tabs"]
["2020-04-15",1.01,"Added Reset Button to Interactive Form","JST","Removes parameters entered into Interactive Form by push button"]
["2020-04-15",1.02,"Added NPT Default to S-Series, updated pressures on interactive form, added IP800s-HP","TEN","Added NPT to S-Series. Added if blank then blank to Quote Template, Updated pressures in SES on Config Pick Data, added IP800S-HP "]
["2020-04-15",1.03,"Click Here Buttons added to each product family configuration","JST","Resets all parameters currently entered in selection cells, then brings user to first selectable cell in configuration"]
["2020-04-17",1.04,"Updated the Instructions tab","TEN","Updated the Instructions tab"]
["2020-04-20",1.05,"Updated WTS data","JST","Corrected a WT source error."]
["2020-04-22",1.06,"Corrected EX Fitting Price","TEN","Fixed bad reference in config data"]
["2020-04-24",1.1000000000000001,"Added Photos","TEN","Added Photos to the tabs"]
["2020-04-29",1.2,"Corrected IP100/200 pricing and -35 option","TEN","Corrected pricing error and configuration error discovered in spec sheet"]
["2021-01-08",2.1,"Updated pricing, removed option 23,24 from Ex and IP 100 200.","TEN","Stuart revised \"P\" option data for the IP100 200. Also added the DC-5 cable for data logger"]
["2021-01-13",2.2000000000000002,"Added FT 400 Series","TEN","Stuart added VBA reset script, I added new tab and pictures"]
["2021-02-03",2.2999999999999998,"Corrected issue with iMAG4700r final part number","TEN","Final part number was missing cell containing remote cable length"]
["2021-03-05",2.4,"Captive Housing Update","TEN","Changed Cables over"]
["2021-03-08",2.41,"Removed HART from Base Model Configurations","TEN","As stated, removed HART from base model"]
["2021-03-15",2.5,"Added 2\", 3\" and battery powered Modbus","TEN","Changed options"]
["2021-04-09",2.5099999999999998,"Fixed iMAG reset buttons, allowed users to change cell formats","TEN","Different display resolutions did not show all contents of cells so unlocked that edit"]
["2021-04-20",2.52,"Fixed WMP broken configurations","JST","WMP did not populate full part number, fixed code population"]
["2021-07-13",2.6,"Updated pricing for mid-year price increase","JST","Mid-year price increase revision"]

{"sheet":"Sheet10","index":21,"n_rows":0,"n_cols":0,"rows_kept":0,"cut":false,"hidden":true,"merged":[]}